program: Gaussian 09
title: 000082750
version: EM64L-G09RevD.01
frameworkgroup: C1[X(C9H18N2O)]
method: RPBEPBE
basis: SDD
operation: Freq
keyword: #p
keyword: freq=noraman
keyword: PBEPBE/SDD
title: #p freq=noraman PBEPBE/SDD
converged: YES YES NO NO
title: Mulliken charges:
elementType: O N N C C C C C C C C C H H H H H H H H H H H H H H H H H H
charge: -0.283174 -0.101941 -0.369610 -0.355082 -0.329702 -0.325453 -0.397398 -0.674531 -0.672458 0.258862 -0.229236 -0.489135 0.192847 0.255004 0.200666 0.188836 0.199800 0.188224 0.261389 0.214300 0.237020 0.221771 0.200719 0.210111 0.226018 0.204827 0.291468 0.204854 0.220362 0.250644
chargesum: 0.00000
title: Mulliken charges with hydrogens summed into heavy atoms:
elementType: O N N C C C C C C C C C
charge: -0.283174 -0.101941 -0.078142 0.092769 0.059800 0.062571 0.078290 -0.015021 -0.031502 0.258862 -0.024382 -0.018129
polarizability: 1.61419570e+02 1.16851613e+01 1.16769945e+02 6.31830172e+00 -2.12101921e+00 8.13684926e+01
1716.lowfreq: -21.4425 -8.6700 -6.8284 0.0003 0.0005 0.0006 14.3329 30.5474 47.1229
frequency: 7.1338 30.4865 46.9976 63.9773 71.9662 90.8441 130.3775 158.8788 209.2650 218.4830 244.1523 277.3314 291.5694 306.8971 342.3212 389.7463 444.7913 467.6689 487.6049 536.7915 554.1726 638.6163 747.8280 767.0370 784.5195 794.2009 799.8130 861.4508 918.2463 979.4968 986.8013 991.3829 1023.3655 1046.7080 1059.5928 1072.5199 1075.8110 1077.9495 1085.9000 1122.7499 1176.2899 1209.6435 1210.2369 1255.1254 1283.5870 1289.6154 1296.1931 1307.1460 1325.0710 1358.2945 1364.7195 1375.1208 1385.6997 1391.6911 1402.7475 1440.3901 1460.9688 1463.5891 1470.3152 1479.2865 1480.7231 1486.6037 1488.2380 1492.8241 1593.5897 1648.7577 2845.3082 2857.8628 2896.5761 2981.7535 2983.2793 3010.0768 3015.9719 3032.5904 3057.2610 3075.5830 3076.9272 3088.7688 3090.0005 3090.7238 3090.9092 3108.2039 3217.0576 3553.2071
redmass: 3.4679 3.7136 3.2549 3.0113 3.3362 2.1710 2.1906 1.7555 2.1370 1.4668 1.5091 1.7903 2.6116 2.7852 3.7007 2.7274 2.7967 2.5994 1.5627 1.7904 2.1527 3.0079 2.0934 1.4329 3.6075 1.1701 1.2217 2.4710 1.9273 1.3362 2.2760 1.1250 4.0589 1.6838 2.9360 2.0150 2.4946 2.1687 1.9479 1.7488 1.6706 2.1105 2.2399 1.3677 1.2455 1.2412 1.1390 1.4549 1.2617 1.3453 1.3279 1.3234 1.2361 1.2257 1.1984 1.1565 1.0516 1.0586 1.0626 1.0647 1.7646 1.0601 1.0739 1.0793 6.8843 4.7129 1.0714 1.0716 1.0708 1.0358 1.0356 1.0872 1.0602 1.0871 1.0892 1.0988 1.0984 1.1042 1.1002 1.0731 1.0995 1.0817 1.1162 1.0781
irintensity: 2.1393 2.5039 3.8020 2.5824 5.4101 0.1508 0.1269 0.9566 2.0105 0.2851 0.0486 2.0475 2.5113 8.7354 7.3161 4.6397 1.7193 3.1013 64.8037 49.4539 9.5570 0.8065 11.1419 3.8244 26.5485 4.5894 7.8644 6.9867 2.1394 1.8915 2.0077 86.9562 1.1019 9.6481 5.7848 11.4042 34.7038 40.8414 4.3743 11.3601 22.2188 81.9051 42.5038 4.7144 7.3318 20.1981 17.9144 8.6686 3.7904 2.5577 4.0140 3.6156 25.5733 17.1476 26.0326 41.2044 7.5956 7.1539 1.6854 3.6480 170.6256 18.4152 19.4183 17.7751 101.1322 12.6991 63.3582 144.0797 101.2663 29.6382 33.4686 24.3341 35.1016 26.6212 7.9125 25.9722 76.8971 15.4659 33.9979 17.6065 47.8338 13.8562 8.7033 17.8773
temp: 298.150 k
press: 1.00000 atm
elementType: 8 7 7 6 6 6 6 6 6 6 6 6 1 1 1 1 1 1 1 1 1 1 1 1 1 1 1 1 1 1
symmnumber: 1
zpe: 684347.5 jmol-1
zpe.correction: 0.260654 hartree
zpe.thermalcorrener: 0.275721 hartree
zpe.thermalcorrenthalpy: 0.276665 hartree
zpe.thermalcorrgfe: 0.215400 hartree
zpe.sumelectzpe: -537.475917 hartree
zpe.sumelectthermal: -537.460851 hartree
zpe.sumelectthermalent: -537.459907 hartree
zpe.sumelectthermalfe: -537.521172 hartree
dipole: -0.2079 -3.6166 1.5770
dipole: 3.9510
quadrupole: -66.3770 -70.7412 -77.8413
quadrupole: -7.1387 1.9406 0.7388
quadrupole: 5.2762 0.9119 -6.1881 -7.1387 1.9406 0.7388
hfenergy: -537.7365714 hartree
pointgroup: C01 [X(C9H18N2O1)]
dipole: -0.0232437 -1.3557981 0.7599458 debye
polarizability: 159.5568597|14.8982418|117.5342547|7.3440358|-4.9491699|82.4668931 unknown
InChI: InChI=1S/C9H18N2O/c1-4-9(12)10-7-8-11(5-2)6-3/h4,10H,1,5-8H2,2-3H3
charge 0 multiplicity 1
30 atoms
O  2.068457 1.210202 -0.418771
N  -2.144359 -0.047797 0.186683
N  1.539252 -1.012789 0.027721
C  -0.747214 -0.17036 0.659747
C  -2.743182 1.291413 0.425249
C  -3.003782 -1.186365 0.597471
C  0.13886 -0.868335 -0.405955
C  -2.167394 2.369889 -0.513062
C  -4.194158 -1.425059 -0.352147
C  2.422803 0.058265 -0.008105
C  3.80981 -0.260747 0.464167
C  4.782225 0.685327 0.478264
H  -0.679194 -0.725796 1.625421
H  -0.321334 0.832565 0.834278
H  -3.831729 1.212295 0.25018
H  -2.615934 1.611213 1.490801
H  -2.371512 -2.095326 0.599948
H  -3.378042 -1.062804 1.64666
H  0.1123 -0.254071 -1.32226
H  -0.262871 -1.86913 -0.64743
H  -1.072268 2.467734 -0.402286
H  -2.377146 2.109612 -1.565293
H  -2.619499 3.355405 -0.293417
H  -4.8831 -0.561615 -0.374801
H  -3.830074 -1.595112 -1.380431
H  -4.776705 -2.30796 -0.028224
H  1.862251 -1.912414 0.386186
H  4.019622 -1.287312 0.797978
H  5.800262 0.467785 0.817622
H  4.550255 1.701987 0.139406
