program: Gaussian 09
title: 000000237
version: EM64L-G09RevD.01
frameworkgroup: C1[X(C23H30ClN3O)]
method: RPBEPBE
basis: SDD
operation: Freq
keyword: #p
keyword: freq=noraman
keyword: PBEPBE/SDD
title: #p freq=noraman PBEPBE/SDD
converged: YES YES NO NO
title: Mulliken charges:
elementType: Cl O N N N C C C C C C C C C C C C C C C C C C C C C C C H H H H H H H H H H H H H H H H H H H H H H H H H H H H H H
charge: -0.064507 -0.269567 -0.114140 -0.417849 -0.046900 -0.088251 -0.385374 -0.380665 -0.381036 0.288095 -0.701091 -0.315763 -0.320109 0.289315 0.247460 -0.113114 -0.086903 -0.672595 -0.672797 -0.507504 -0.341096 -0.320290 -0.297660 0.288331 -0.358545 -0.280041 -0.113654 -0.536607 0.236559 0.190414 0.217646 0.189310 0.218870 0.199890 0.194279 0.284902 0.236412 0.219775 0.203585 0.187643 0.203045 0.186808 0.211961 0.206493 0.222322 0.208294 0.208033 0.217748 0.210644 0.218363 0.256483 0.264728 0.287420 0.246916 0.253420 0.245822 0.222665 0.222406
chargesum: 0.00000
title: Mulliken charges with hydrogens summed into heavy atoms:
elementType: Cl O N N N C C C C C C C C C C C C C C C C C C C C C C C
charge: -0.064507 -0.269567 -0.114140 -0.132947 -0.046900 0.148308 0.022685 0.027516 0.013133 0.288095 -0.041319 0.074925 0.078660 0.289315 0.247460 -0.113114 -0.086903 -0.035486 -0.036373 -0.289140 -0.084613 -0.055562 -0.010239 0.288331 -0.111629 -0.026620 -0.113654 0.154286
polarizability: 3.43832379e+02 -2.90412861e+01 4.41848645e+02 -3.03373135e+01 -5.36434684e+00 1.86944787e+02
1716.lowfreq: -14.1504 -3.7485 -0.0010 -0.0004 -0.0002 2.1980 3.7457 12.0097 20.4626
frequency: -10.9535 11.2848 20.4421 36.5929 38.6997 44.5125 58.0516 70.4217 79.8067 80.7482 108.6967 112.9419 135.7824 136.5869 144.8233 178.5445 189.9540 200.7278 201.1959 211.6163 217.5801 230.2327 253.5878 264.4892 284.0338 286.9465 291.3738 301.8605 320.2181 327.7054 348.6212 386.5314 399.9417 409.8483 423.2666 428.7159 436.3749 453.9236 463.6752 473.6369 518.8943 527.4961 535.0941 553.4972 587.4816 610.6317 619.8148 645.6009 661.6815 672.5595 699.6992 704.7711 729.9739 750.4917 774.9069 775.9817 792.2624 794.5789 810.4600 821.0670 828.6588 850.0620 855.6251 888.8839 891.3104 901.6887 913.3423 922.9770 942.4370 949.4646 958.3364 966.4490 989.0929 1012.3993 1017.7290 1046.6843 1057.0648 1072.3346 1077.9368 1083.6768 1085.4760 1108.5402 1110.3243 1110.6726 1120.1277 1124.7419 1138.6523 1143.6951 1165.8328 1168.6293 1196.5508 1204.5566 1207.7717 1217.6472 1241.9637 1252.0762 1259.5378 1275.1127 1283.5975 1286.6787 1291.2220 1294.5425 1317.8886 1321.5645 1343.2507 1355.1060 1359.9701 1366.8837 1370.3681 1376.1893 1381.7805 1385.1036 1385.4108 1390.2277 1415.9646 1429.2135 1436.3645 1445.4458 1455.2981 1458.9270 1461.7318 1463.2982 1466.4109 1468.1435 1469.3201 1472.7419 1473.6244 1476.0622 1478.3006 1481.4955 1486.9164 1490.2282 1492.4951 1520.2355 1544.4684 1548.9052 1602.3493 1634.3776 2851.5782 2856.1716 2869.9295 2961.1875 2963.8686 2968.7010 2972.5397 2981.9551 2982.3103 3010.3247 3025.4299 3031.2078 3035.3959 3040.9720 3048.3588 3050.3956 3074.5663 3075.3565 3076.9300 3083.2047 3086.9622 3088.5619 3124.2806 3139.5340 3151.2910 3159.7358 3173.0842 3179.7054 3182.1285 3485.9566
redmass: 3.6479 4.4475 3.9637 4.2561 4.4651 3.6727 4.0654 2.6093 2.1459 3.1138 3.1519 4.3157 2.9242 4.0641 3.3169 4.0938 1.3188 1.2023 1.8399 1.5770 1.5479 3.0497 6.0051 3.0271 2.6808 2.9756 2.1186 2.8395 3.6385 2.7855 3.1635 3.8915 4.2762 4.3969 3.5271 2.9604 3.2486 3.0933 2.5309 3.0024 5.0205 3.1604 4.5937 3.2239 3.7226 4.0778 3.4312 3.4258 3.8565 5.9116 2.3111 5.3667 3.2751 6.3343 1.4741 1.8620 1.2089 1.1908 1.5986 2.8544 1.9368 2.2237 2.0389 1.5030 2.6783 4.6559 1.9327 1.6932 1.9586 4.0854 1.3249 1.3411 1.7381 3.3899 2.8825 2.1984 2.1271 1.8979 2.1483 2.4967 2.0824 2.0716 2.6239 1.2887 2.0104 1.6897 2.0614 1.5341 1.7098 1.5645 2.0680 2.3969 1.7955 1.6184 3.1849 1.4428 1.4979 1.4983 1.1561 1.8722 1.2999 1.2122 1.5369 2.0759 1.3121 1.5650 1.3360 1.3818 3.2170 1.3558 1.2534 1.2363 1.2353 4.7031 3.5210 2.2093 1.4504 2.3271 1.3769 1.0774 1.0568 1.3315 1.0727 1.0507 1.0888 1.0824 1.0982 1.3180 1.0666 1.0881 1.0831 1.0832 2.9129 6.7455 6.6043 4.0902 6.3988 6.8114 1.0722 1.0719 1.0709 1.0329 1.0604 1.0602 1.0370 1.0355 1.0355 1.0949 1.0926 1.0878 1.0876 1.0930 1.0924 1.1042 1.0971 1.0985 1.0981 1.1000 1.1003 1.1003 1.0994 1.0896 1.0869 1.0867 1.0972 1.0942 1.0953 1.0736
irintensity: 0.0927 0.3179 0.0231 0.6249 0.3551 0.0899 0.1527 1.1381 1.4666 3.9985 1.0076 1.5432 1.3496 0.7630 0.3724 4.6127 1.1624 0.5760 0.3860 1.2946 0.1096 0.8768 3.7818 3.3457 3.5818 1.2632 1.4173 0.7915 0.3394 1.1328 1.1700 5.5028 5.1096 8.8615 7.7746 0.9699 0.7714 15.3014 0.9932 4.9539 2.5072 10.6484 24.0250 8.6646 18.3357 6.2439 31.4721 39.7593 23.7388 15.4927 13.7520 2.1898 0.6782 26.9705 5.2205 8.4476 10.2844 3.8488 51.9793 4.2529 35.8246 4.3593 17.5779 22.8785 25.3250 54.5528 0.3527 0.5822 10.9464 28.2293 2.0069 0.6972 23.0940 60.4624 6.6614 9.8868 35.9756 17.7065 19.7103 7.6326 19.9034 6.2726 39.6335 1.7063 26.3769 11.7979 135.9178 25.6336 8.9263 3.8565 22.0065 254.3473 24.3401 14.9890 2.3223 23.7263 24.8380 17.8715 4.9360 15.8086 7.2601 56.9646 28.9899 1.8947 0.1296 6.1171 13.2617 13.6171 60.0034 4.7362 11.0026 18.5927 19.0137 32.4107 29.3451 17.6225 27.8817 101.2883 58.5361 10.2501 3.8774 78.5703 3.1107 14.2852 26.6216 36.3946 15.3187 11.8948 15.3601 10.2038 13.5738 11.2697 136.3136 105.6692 130.5994 10.0947 43.1657 155.0540 30.7398 56.0027 256.6434 105.1217 4.5982 46.9749 34.0318 35.2044 21.0693 4.1613 3.2661 8.8240 15.3011 61.4415 16.3954 46.5697 42.1069 43.4087 82.4645 35.9937 60.2688 44.1566 26.0997 10.5686 3.1986 0.1983 17.4738 1.6358 6.8204 12.4793
temp: 298.150 k
press: 1.00000 atm
elementType: 17 8 7 7 7 6 6 6 6 6 6 6 6 6 6 6 6 6 6 6 6 6 6 6 6 6 6 6 1 1 1 1 1 1 1 1 1 1 1 1 1 1 1 1 1 1 1 1 1 1 1 1 1 1 1 1 1 1
symmnumber: 1
zpe: 1267579.4 jmol-1
zpe.correction: 0.482795 hartree
zpe.thermalcorrener: 0.510897 hartree
zpe.thermalcorrenthalpy: 0.511841 hartree
zpe.thermalcorrgfe: 0.422141 hartree
zpe.sumelectzpe: -1591.876203 hartree
zpe.sumelectthermal: -1591.848102 hartree
zpe.sumelectthermalent: -1591.847157 hartree
zpe.sumelectthermalfe: -1591.936857 hartree
dipole: -5.4655 3.1376 0.8217
dipole: 6.3554
quadrupole: -183.5382 -152.8330 -176.0551
quadrupole: 20.6246 1.0358 -3.9414
quadrupole: -12.7294 17.9757 -5.2463 20.6246 1.0358 -3.9414
hfenergy: -1592.358998 hartree
pointgroup: C01 [X(C23H30Cl1N3O1)]
dipole: -1.6656522 -1.8225451 -0.3950291 debye
polarizability: 335.5882579|-6.059721|449.0564371|31.5553761|12.4769163|187.981116 unknown
InChI: InChI=1S/C23H30ClN3O/c1-5-27(6-2)13-7-8-16(3)25-23-19-11-9-17(24)14-22(19)26-21-12-10-18(28-4)15-20(21)23/h9-12,14-16,25H,5-8,13H2,1-4H3
charge 0 multiplicity 1
58 atoms
Cl 2.993848 5.844089 0.663718
O  1.80085 -4.584608 -0.230804
N  -4.877862 -0.402325 0.632201
N  -0.532345 -0.033479 -0.56124
N  3.606524 0.708973 0.400165
C  -1.259292 0.598374 -1.708219
C  -2.781566 0.530744 -1.445684
C  -3.257034 1.338455 -0.220938
C  -4.714699 1.005243 0.173798
C  0.802411 0.217948 -0.220877
C  -0.881996 -0.103576 -3.036809
C  -6.245377 -0.934704 0.377942
C  -4.447271 -0.585203 2.047005
C  1.72798 -0.879891 -0.051143
C  1.28672 1.54985 0.018874
C  3.113016 -0.566545 0.279156
C  2.712567 1.737011 0.275419
C  -6.480833 -1.310566 -1.097624
C  -4.028185 -2.032056 2.370251
C  1.357281 -2.251609 -0.221796
C  0.429414 2.703112 0.092159
C  4.036279 -1.651722 0.460068
C  3.225066 3.074258 0.446341
C  2.286281 -3.279953 -0.036198
C  3.645478 -2.979394 0.318758
C  0.938474 3.982762 0.2977
C  2.352416 4.14797 0.438659
C  2.740194 -5.698004 -0.072773
H  -0.937667 1.651226 -1.774343
H  -3.306573 0.881725 -2.356834
H  -3.082123 -0.527123 -1.295115
H  -3.18808 2.427166 -0.427097
H  -2.581068 1.129783 0.631233
H  -5.064904 1.728452 0.952574
H  -5.363357 1.158002 -0.709353
H  -0.829353 -1.005859 -0.428881
H  0.211379 -0.090382 -3.192753
H  -1.360262 0.405552 -3.893885
H  -1.220946 -1.157467 -3.036285
H  -7.031391 -0.211573 0.71515
H  -6.374397 -1.84292 0.994218
H  -5.24673 -0.254297 2.758288
H  -3.580743 0.077546 2.224831
H  -6.380766 -0.437674 -1.768026
H  -5.74613 -2.070276 -1.417462
H  -7.498545 -1.721801 -1.234352
H  -4.858951 -2.746319 2.226584
H  -3.195986 -2.344346 1.714963
H  -3.697042 -2.111779 3.422478
H  0.346087 -2.551435 -0.517201
H  -0.654222 2.569351 0.04326
H  5.065698 -1.384132 0.716637
H  4.300686 3.187664 0.60143
H  4.375279 -3.780454 0.468375
H  0.276393 4.849605 0.374184
H  2.147473 -6.601039 -0.280186
H  3.576231 -5.628803 -0.795435
H  3.141275 -5.747047 0.958093
