program: Gaussian 09
title: 000082734
version: EM64L-G09RevD.01
frameworkgroup: C1[X(C5H7NO2S)]
method: RPBEPBE
basis: SDD
operation: Freq
keyword: #p
keyword: freq=noraman
keyword: PBEPBE/SDD
title: #p freq=noraman PBEPBE/SDD
converged: NO NO NO NO
title: Mulliken charges:
elementType: S O O N C C C C C H H H H H H H
charge: 0.101891 -0.177481 -0.198001 -0.142307 -0.344650 0.208616 -0.410980 -0.129369 -0.648683 0.247025 0.248681 0.272026 0.270465 0.239910 0.233953 0.228905
chargesum: 0.00000
title: Mulliken charges with hydrogens summed into heavy atoms:
elementType: S O O N C C C C C
charge: 0.101891 -0.177481 -0.198001 -0.142307 0.151056 0.208616 0.131511 -0.129369 0.054085
polarizability: 1.18565062e+02 -7.15414749e+00 8.03782361e+01 1.41022425e+00 -3.61332989e+00 4.90260102e+01
1716.lowfreq: -13.2134 -9.1399 -0.0031 -0.0029 -0.0026 11.5190 43.9880 97.5645 147.7186
frequency: 43.2054 97.5620 147.7048 186.0383 196.2996 257.6002 299.8625 402.7354 477.5406 515.8203 538.8548 623.0490 649.9245 661.2709 775.0890 897.0297 932.2643 950.2726 986.6978 1040.4500 1082.0927 1103.4152 1128.9301 1155.1279 1267.1981 1292.0606 1321.1990 1347.6936 1372.2195 1390.3940 1442.3283 1454.5678 1471.5529 1480.8604 1674.5974 2997.3907 3025.6674 3038.3220 3086.0591 3097.3405 3107.4456 3112.3526
redmass: 2.6542 7.0251 4.2958 2.9705 1.2738 3.4584 2.9280 4.1871 11.3979 4.6688 3.9825 7.0373 4.0039 8.6790 1.2535 3.6878 6.8581 2.4622 1.9078 4.1601 3.6601 2.5550 1.0923 2.2653 2.0593 1.5912 3.2141 1.6797 1.6412 1.2147 1.0804 1.1114 1.0425 1.0521 11.6399 1.0354 1.0595 1.0575 1.1036 1.0992 1.1081 1.1038
irintensity: 0.1545 6.2711 0.2149 14.7167 1.1977 3.4273 5.3926 1.9763 0.2043 17.7247 1.7370 4.0364 7.2732 11.0888 19.4461 23.2969 42.4245 16.5253 0.7546 62.3099 10.9762 15.1741 0.7039 59.7390 313.6886 24.7742 107.7837 217.8026 120.5220 16.9792 19.0685 43.6267 10.1738 9.2904 290.4232 17.2257 15.2207 10.1872 1.2559 27.2054 2.2406 13.1494
temp: 298.150 k
press: 1.00000 atm
elementType: 16 8 8 7 6 6 6 6 6 1 1 1 1 1 1 1
symmnumber: 1
zpe: 311795.2 jmol-1
zpe.correction: 0.118757 hartree
zpe.thermalcorrener: 0.127722 hartree
zpe.thermalcorrenthalpy: 0.128666 hartree
zpe.thermalcorrgfe: 0.083799 hartree
zpe.sumelectzpe: -797.311983 hartree
zpe.sumelectthermal: -797.303018 hartree
zpe.sumelectthermalent: -797.302074 hartree
zpe.sumelectthermalfe: -797.346940 hartree
dipole: 1.7015 0.6429 0.0778
dipole: 1.8205
quadrupole: -74.5024 -54.4120 -58.2724
quadrupole: -7.6585 1.6866 -0.4449
quadrupole: -12.1068 7.9835 4.1232 -7.6585 1.6866 -0.4449
hfenergy: -797.4307396 hartree
pointgroup: C01 [X(C5H7N1O2S1)]
dipole: -0.4324892 -0.5696607 -0.0382521 debye
dipolederiv: -0.2724213 -0.0222624 0.0112552 -0.078103 -0.8569938 -0.0440747 0.0097734 -0.0476017 -0.1649565 -0.7086848 0.4145263 0.1081881 0.2960692 -0.9195021 -0.098845 0.129055 -0.1440828 -0.2432881 -0.6177433 -0.5139364 0.0411121 -0.2244105 -1.1110765 0.0283733 0.0456067 0.0701629 -0.3308692 -0.8792308 -0.1655707 0.0647759 -0.4606265 -1.6834322 0.0254026 0.0927301 -0.0455521 -0.161303 0.5484654 -0.0899344 0.0086903 -0.1490083 0.1254703 -0.0004315 -0.0456345 -0.0059939 0.231738 0.6787343 0.1573061 -0.1078481 0.2869973 1.9544332 -0.0077025 -0.0736878 0.0691124 0.2007795 -0.1675472 0.124895 0.1087587 -0.0048224 0.4271932 0.0035355 0.1079281 -0.0146596 0.2884068 1.1475926 0.1126674 -0.201896 0.2893104 1.949802 0.1110423 -0.2272424 0.1107046 0.0320142 -0.0425367 0.0227952 -0.0269031 0.0288163 0.0492936 0.017269 -0.0203785 0.0317905 -0.0528749 0.0146075 0.0051946 0.0206024 -0.0614115 0.0179438 0.1205111 0.009372 0.0544479 0.0340662 0.053389 -0.0199392 -0.0741402 0.0499421 0.0097699 -0.1068435 -0.0336523 -0.0478471 0.0251916 0.0848956 0.0069739 -0.0474714 0.0205271 -0.0034307 0.0288622 -0.0664579 0.0816466 0.0467349 0.1194941 -0.0356793 0.0052651 -0.0014258 0.0072769 -0.0361958 0.0314538 -0.0786309 -0.0033317 0.0673167 -0.0959909 0.0663588 -0.0506404 0.0013651 0.090908 0.0269276 0.0497096 0.020776 0.1037524 0.0155921 -0.0172199 -0.0328862 -0.0508477 -0.1147191 -0.031333 -0.0633185 0.004888 -0.1300835 0.0833628 0.0404721 0.0916722 0.0827352 -0.017092 0.0455397 -0.0198878 0.0720283 unknown
polarizability: 79.6281485|4.4004441|119.3514253|-2.7079029|2.7879919|48.989735 unknown
InChI: InChI=1S/C5H7NO2S/c1-2-6-4(7)3-8-5(6)9/h2-3H2,1H3
charge 0 multiplicity 1
16 atoms
S  0.945574 2.530505 0.130352
O  1.918357 0.025402 -0.261125
O  -0.844723 -2.262727 0.207464
N  -0.303241 0.053026 0.242165
C  -1.652238 0.575055 0.550589
C  -0.027154 -1.323384 0.084016
C  1.463448 -1.393869 -0.247423
C  0.829111 0.863394 0.036795
C  -2.445319 0.918078 -0.725394
H  -2.167024 -0.2091 1.131922
H  -1.517023 1.471449 1.180241
H  2.033713 -1.940513 0.52177
H  1.647052 -1.83394 -1.241465
H  -1.931071 1.700473 -1.308887
H  -2.582498 0.024784 -1.358191
H  -3.444063 1.297767 -0.44603
