program: Gaussian 09
title: 000082925
version: EM64L-G09RevD.01
frameworkgroup: C1[X(C12H17BrN2O3)]
method: RPBEPBE
basis: SDD
operation: Freq
keyword: #p
keyword: freq=noraman
keyword: PBEPBE/SDD
title: #p freq=noraman PBEPBE/SDD
converged: YES YES NO NO
title: Mulliken charges:
elementType: Br O O O N N C C C C C C C C C C C C H H H H H H H H H H H H H H H H H
charge: -0.004274 -0.208373 -0.191737 -0.218063 -0.379003 -0.382684 0.091207 -0.077101 -0.408598 -0.415858 -0.566132 0.149877 0.171180 -0.711841 -0.719560 0.071444 0.139782 -0.567526 0.264438 0.213858 0.221184 0.207392 0.249898 0.287844 0.244565 0.238805 0.221433 0.207133 0.219300 0.221512 0.216740 0.366004 0.364418 0.252607 0.230130
chargesum: 0.00000
title: Mulliken charges with hydrogens summed into heavy atoms:
elementType: Br O O O N N C C C C C C C C C C C C
charge: -0.004274 -0.208373 -0.191737 -0.218063 -0.012999 -0.018266 0.091207 0.187337 0.026444 0.041432 -0.033723 0.149877 0.171180 -0.044470 -0.062008 0.071444 0.139782 -0.084789
polarizability: 1.92368136e+02 2.28297872e+01 1.74028769e+02 9.08682968e+00 -8.18785095e+00 1.29481553e+02
1716.lowfreq: -8.8487 -0.0007 -0.0007 -0.0006 10.1349 12.8668 18.0389 31.2284 43.2802
frequency: 16.8319 30.9963 42.6063 65.5791 85.0621 109.7006 126.2749 136.0184 140.9940 160.8946 164.3629 188.7002 219.6443 242.8176 258.2160 265.0965 267.9317 311.0031 345.9004 357.9062 369.4530 377.3956 411.3300 454.2795 479.9669 495.1505 507.6030 555.0297 602.6354 635.6378 655.4938 662.0770 684.4434 696.8445 729.4228 760.2481 761.6946 788.1614 811.5255 837.4305 888.9443 913.4780 923.5367 927.9014 968.3218 993.3478 1001.4058 1013.7557 1024.6274 1048.8066 1063.4440 1108.4871 1125.6013 1145.3167 1162.5556 1185.5026 1242.2851 1252.3423 1283.8635 1296.3689 1319.5824 1322.8594 1323.5464 1348.1329 1359.2047 1365.3132 1375.1374 1376.2883 1389.9690 1399.0060 1409.5524 1460.1900 1470.2935 1475.4227 1478.7963 1481.6487 1490.0327 1490.7941 1615.3153 1635.3663 1651.1211 1676.7370 2977.2286 2977.9925 2985.4591 2993.3767 3001.4530 3010.5384 3040.6490 3056.0304 3065.9882 3071.8912 3072.7449 3085.6240 3086.2497 3101.0280 3222.4753 3515.4746 3518.1671
redmass: 4.8795 7.7637 4.1615 3.4148 3.1046 3.9108 10.5610 2.5506 3.8157 9.6046 3.4877 4.2059 2.7859 1.7682 1.7873 3.1439 1.5077 2.9747 3.6530 10.1287 2.5272 11.3700 3.2269 2.9723 8.5219 4.4142 3.0114 5.5117 5.0663 4.8051 1.4160 2.2894 2.3859 3.1430 2.4817 1.6988 1.3943 1.6337 1.4822 2.1208 2.0084 2.7411 2.0420 1.3460 2.4913 3.5651 2.9411 1.3849 2.1687 2.7961 2.4812 2.0776 2.4548 2.6193 2.2578 4.9888 1.5261 1.3485 1.2477 2.6573 1.2009 1.2846 1.2769 1.3977 1.3905 9.0580 1.9907 1.4824 1.1993 1.2039 1.1542 1.0947 1.0570 1.0692 1.0607 1.0548 1.0510 1.0569 6.9384 5.5647 8.8768 5.5325 1.0364 1.0369 1.0647 1.0645 1.0764 1.0643 1.0982 1.0987 1.0980 1.0970 1.0981 1.1004 1.1004 1.0648 1.1128 1.0762 1.0776
irintensity: 0.3233 0.1386 0.3596 0.0796 0.6213 0.5503 0.6650 0.6174 0.6776 9.3642 1.4009 0.9052 0.3700 2.0177 1.3167 0.6888 2.8577 3.4249 2.2620 25.9334 1.1983 4.4638 1.8815 3.2420 12.9228 29.0309 13.8370 5.0242 2.5690 6.4898 4.1730 7.1943 20.0682 5.3534 14.6247 2.6312 9.5463 212.9241 1.5466 6.3119 14.4475 9.5649 5.6714 68.1281 11.9494 3.0359 7.7799 2.1910 2.0916 1.8075 1.5615 33.6535 3.3039 75.3177 0.8753 27.4926 18.8371 14.9257 20.8059 291.1001 21.6050 9.5042 4.0572 2.1777 2.1326 216.6711 4.4641 2.2476 14.5283 12.0876 5.7293 24.1829 7.5575 0.0315 20.7670 7.5158 2.8225 22.8219 265.1879 49.0175 74.4811 620.4846 33.0026 31.5299 15.2547 12.6528 6.1667 14.8780 5.1890 5.0042 67.0779 11.3003 27.2812 74.9204 21.9254 3.0830 3.6012 80.4540 51.9845
temp: 298.150 k
press: 1.00000 atm
elementType: 35 8 8 8 7 7 6 6 6 6 6 6 6 6 6 6 6 6 1 1 1 1 1 1 1 1 1 1 1 1 1 1 1 1 1
symmnumber: 1
zpe: 730194.2 jmol-1
zpe.correction: 0.278116 hartree
zpe.thermalcorrener: 0.297407 hartree
zpe.thermalcorrenthalpy: 0.298351 hartree
zpe.thermalcorrgfe: 0.228855 hartree
zpe.sumelectzpe: -814.752324 hartree
zpe.sumelectthermal: -814.733033 hartree
zpe.sumelectthermalent: -814.732089 hartree
zpe.sumelectthermalfe: -814.801585 hartree
dipole: -0.2154 -0.3130 -0.4977
dipole: 0.6261
quadrupole: -128.8881 -113.0115 -122.4989
quadrupole: -3.0563 -1.8923 4.6574
quadrupole: -7.4220 8.4547 -1.0327 -3.0563 -1.8923 4.6574
hfenergy: -815.0304401 hartree
pointgroup: C01 [X(C12H17Br1N2O3)]
dipole: 0.1405105 0.043461 -0.1976121 debye
polarizability: 207.3469392|5.0839598|161.9289743|-1.5068186|7.0859496|126.6025438 unknown
InChI: InChI=1S/C12H17BrN2O3/c1-4-8(5-2)12(6-7(3)13)9(16)14-11(18)15-10(12)17/h8,14-15H,3-6H2,1-2H3
charge 0 multiplicity 1
35 atoms
Br -2.900506 2.452648 -0.292577
O  0.384877 -1.825899 -1.798461
O  0.017247 1.279415 1.923519
O  4.137831 0.046966 0.186407
N  2.209425 -0.868513 -0.768985
N  2.035726 0.728876 0.955572
C  -0.092936 -0.046294 -0.153615
C  -1.358394 -0.812776 0.415748
C  -0.955122 -2.106324 1.19392
C  -2.432987 -1.170016 -0.651881
C  -0.410504 1.104783 -1.229705
C  0.817867 -1.002672 -0.951888
C  0.624647 0.676051 1.006728
C  0.037329 -1.959493 2.369567
C  -3.78097 -1.6052 -0.031617
C  -0.971972 2.415649 -0.727024
C  2.885363 -0.019927 0.127049
C  -0.272406 3.567408 -0.608773
H  -1.812884 -0.103158 1.13497
H  -1.890045 -2.534541 1.599198
H  -0.568826 -2.851043 0.46979
H  -2.643666 -0.291896 -1.287398
H  -2.042628 -1.960768 -1.317971
H  -1.062682 0.65805 -1.998596
H  0.544841 1.355863 -1.731493
H  -0.300931 -1.197904 3.094266
H  0.130212 -2.923004 2.903584
H  1.056852 -1.683256 2.040312
H  -4.538069 -1.747568 -0.824402
H  -4.163087 -0.834216 0.664487
H  -3.705165 -2.557483 0.522782
H  2.808243 -1.455943 -1.359331
H  2.498833 1.299342 1.670993
H  -0.724084 4.499309 -0.261271
H  0.795471 3.584532 -0.860904
