program: Gaussian 09
title: 000083011
version: EM64L-G09RevD.01
frameworkgroup: C1[X(C17H16N4O7S)]
method: RPBEPBE
basis: SDD
operation: Freq
keyword: #p
keyword: freq=noraman
keyword: PBEPBE/SDD
title: #p freq=noraman PBEPBE/SDD
converged: YES YES NO NO
title: Mulliken charges:
elementType: S O O O O O O O N N N N C C C C C C C C C C C C C C C C C H H H H H H H H H H H H H H H H
charge: 1.039621 -0.551213 -0.221279 -0.503483 -0.474979 -0.146533 -0.149306 -0.216188 -0.484817 -0.065966 0.009037 -0.032749 0.332907 0.271259 -0.129555 0.330681 -0.666409 0.121134 -0.361378 -0.178026 0.214306 -0.246518 -0.334904 -0.384704 0.228081 -0.837644 -0.528355 -0.229798 -0.365199 0.285665 0.271261 0.329827 0.353696 0.295630 0.294597 0.307381 0.247447 0.273738 0.255886 0.249192 0.230135 0.248470 0.241307 0.284293 0.393455
chargesum: 0.00000
title: Mulliken charges with hydrogens summed into heavy atoms:
elementType: S O O O O O O O N N N N C C C C C C C C C C C C C C C C C
charge: 1.039621 -0.157758 -0.221279 -0.503483 -0.474979 -0.146533 -0.149306 -0.216188 -0.131121 -0.065966 0.009037 -0.032749 0.332907 0.271259 -0.129555 0.330681 -0.109483 0.121134 -0.031551 0.117604 0.214306 0.048079 -0.027523 -0.137257 0.228081 -0.109847 0.001269 0.011509 -0.080906
polarizability: 3.99358473e+02 2.37246501e+00 2.01853114e+02 9.05285725e+00 -1.88530207e+01 2.39675632e+02
1716.lowfreq: -6.0088 -0.3772 -0.0005 0.0007 0.0013 4.6121 19.5644 29.5761 33.6417
frequency: 19.4911 29.4963 33.6393 45.6086 49.7359 63.7956 66.1606 69.2685 88.3809 90.2838 96.2434 107.1001 117.4036 127.6330 134.1266 151.2817 156.4741 187.4472 189.8021 199.8573 217.0550 248.4904 265.1788 277.3897 285.1632 289.3390 308.1667 319.3051 337.6583 358.7329 375.9504 394.0888 411.0998 422.0387 435.9886 437.4509 452.4708 457.1511 482.0417 503.5882 526.4171 538.1765 546.4440 556.9413 588.6167 605.8606 614.7717 643.8824 669.0639 673.8435 678.9988 711.5511 725.8233 749.5831 772.1197 788.0832 794.0997 797.7449 820.0974 834.4712 842.4974 844.8981 884.2942 894.1614 910.4109 931.0710 952.4543 969.2035 972.1387 984.2569 986.3633 995.9180 1026.1613 1039.5868 1045.4918 1062.0396 1072.0059 1090.8242 1108.4879 1111.5934 1144.2178 1166.9356 1174.0884 1184.9537 1200.3249 1215.3244 1220.8944 1229.4640 1249.8247 1271.7184 1276.7149 1292.6897 1302.9950 1362.7855 1370.0155 1384.1081 1398.6185 1404.8264 1409.8229 1422.7293 1429.2887 1434.8951 1446.3350 1459.6509 1473.5798 1485.3132 1514.2327 1575.0025 1582.9701 1583.4610 1611.7871 1628.8588 1656.1743 2964.9110 2974.7569 3001.8920 3044.8389 3080.4103 3094.8042 3103.4654 3126.1539 3143.4506 3159.3354 3162.2836 3164.1104 3180.2383 3193.0334 3227.9133 3477.1120
redmass: 6.9525 9.9095 9.4267 6.5627 8.9333 6.0564 6.4444 5.1275 8.3260 4.5664 5.1481 6.7733 3.4492 5.5290 1.5596 5.3526 6.1979 9.5407 3.4030 9.5484 8.6400 6.9748 6.2986 4.8075 6.8517 5.0338 4.2145 7.4408 8.5384 6.8585 4.0530 8.2114 3.6030 4.9747 4.8344 1.9316 1.5475 3.5594 3.8788 5.0364 4.6279 4.1656 7.5078 4.5824 5.7112 5.6525 6.9701 7.0877 1.6318 3.3424 6.2072 5.1748 3.4035 5.1054 3.4956 1.4948 3.7995 3.3740 6.8210 4.7091 6.9325 1.7492 1.3078 2.7192 1.4592 4.4641 1.6379 2.9428 1.4629 1.6062 3.1077 1.3725 2.9527 1.5745 2.0520 2.0345 6.6143 2.6656 1.2349 2.0354 1.4898 2.7338 1.1278 2.8032 2.0036 2.1867 2.0144 1.5736 1.4343 1.6513 1.5827 1.5333 1.6976 7.2034 6.2549 5.5609 7.3590 1.2562 4.8180 1.1790 1.1068 2.1902 2.4534 1.7003 1.0611 1.4305 2.0038 8.8129 6.8313 6.1623 5.5703 3.9753 10.0914 1.0636 1.0391 1.0599 1.0967 1.1011 1.0968 1.0962 1.0865 1.0923 1.0968 1.0931 1.0888 1.0974 1.0952 1.0689 1.0773
irintensity: 2.0532 0.6922 3.1163 0.5837 2.0687 5.1179 0.6221 0.9176 2.4298 4.5175 4.4235 3.6021 1.6543 1.7505 2.7806 0.9710 0.3087 2.6824 1.2474 3.2632 1.0990 3.7161 7.7295 12.8794 4.3905 2.5862 1.1243 2.1621 8.3082 7.7611 7.7926 14.1111 2.2806 33.4223 22.0434 68.8021 71.3759 6.1759 23.2145 0.4079 3.9328 28.6116 46.4659 32.2917 6.1712 2.2672 22.0827 6.9970 57.5179 51.9642 7.6851 1.5672 2.1884 19.2480 1.5142 132.2544 16.4793 17.8794 11.7581 82.9883 62.0022 36.3551 0.8611 6.1722 12.6698 9.1158 13.5543 55.5299 1.9906 2.7030 28.9802 4.9349 15.9223 4.6354 8.5657 23.7806 16.0720 94.9635 37.7837 6.4522 5.0159 93.8188 4.5199 10.0745 3.1227 75.7599 42.7106 52.4753 12.6860 20.6904 13.3509 5.8115 118.3870 124.3209 32.8946 80.5647 18.4910 29.2185 27.3409 26.9496 35.1164 55.6183 9.7754 67.6883 13.7830 28.8854 209.8490 5.3629 14.5176 62.3558 3.1129 53.9077 344.4451 15.6165 17.7022 1.3634 16.9386 0.7416 10.1439 0.8065 1.7039 9.5252 8.3999 17.4960 2.0379 2.1971 2.8398 478.3472 52.4456
temp: 298.150 k
press: 1.00000 atm
elementType: 16 8 8 8 8 8 8 8 7 7 7 7 6 6 6 6 6 6 6 6 6 6 6 6 6 6 6 6 6 1 1 1 1 1 1 1 1 1 1 1 1 1 1 1 1
symmnumber: 1
zpe: 827369.2 jmol-1
zpe.correction: 0.315128 hartree
zpe.thermalcorrener: 0.343488 hartree
zpe.thermalcorrenthalpy: 0.344433 hartree
zpe.thermalcorrgfe: 0.254645 hartree
zpe.sumelectzpe: -1798.630183 hartree
zpe.sumelectthermal: -1798.601823 hartree
zpe.sumelectthermalent: -1798.600879 hartree
zpe.sumelectthermalfe: -1798.690666 hartree
dipole: -2.3654 0.2220 0.8382
dipole: 2.5193
quadrupole: -224.2763 -180.5489 -173.6656
quadrupole: 20.3213 -0.2740 13.6758
quadrupole: -31.4461 12.2814 19.1647 20.3213 -0.2740 13.6758
hfenergy: -1798.945311 hartree
pointgroup: C01 [X(C17H16N4O7S1)]
dipole: -0.9638707 -0.0114958 -0.2307615 debye
polarizability: 385.793152|-50.5405781|207.5983503|-9.2173206|6.9331652|247.4957172 unknown
InChI: InChI=1S/C17H16N4O7S/c1-11-4-2-3-5-14(11)19-17(23)8-12(22)10-18-20-15-7-6-13(29(26,27)28)9-16(15)21(24)25/h2-7,9,19,26H,8,10H2,1H3
charge 0 multiplicity 1
45 atoms
S  4.219247 -0.115775 -0.03916
O  3.842062 -1.229252 1.379615
O  -3.059462 -0.658816 1.876697
O  4.430967 -0.943953 -1.414397
O  5.33669 0.876198 0.552334
O  -5.612968 1.609353 0.802386
O  0.449023 1.354253 -3.810206
O  -1.375407 0.589988 -2.671829
N  -1.861143 -1.14076 -0.096482
N  -1.397775 2.258976 -0.433441
N  -0.165179 1.054861 -2.723193
N  -2.054798 2.245116 0.68941
C  -0.754955 -1.89658 0.397754
C  0.017802 -2.646681 -0.548797
C  2.539713 0.740643 -0.172455
C  0.572898 1.20395 -1.450223
C  -3.921901 0.200106 -0.256696
C  -0.056257 1.75812 -0.302565
C  1.885966 0.697386 -1.408271
C  1.988014 1.323747 0.984139
C  -2.903411 -0.560384 0.627901
C  0.684046 1.84347 0.905847
C  -0.408871 -1.90203 1.776374
C  1.150317 -3.351026 -0.077401
C  -4.433721 1.471792 0.41956
C  -0.38719 -2.745961 -2.009994
C  -3.447946 2.685252 0.542199
C  0.717223 -2.627575 2.215957
C  1.514124 -3.347462 1.29231
H  -4.795161 -0.455422 -0.420472
H  -3.479078 0.46222 -1.236448
H  2.352384 0.244897 -2.289648
H  -1.85763 -0.945959 -1.103551
H  2.550509 1.341716 1.922268
H  0.195806 2.288201 1.777734
H  -1.035612 -1.357509 2.484711
H  1.74294 -3.932538 -0.793019
H  -3.744278 3.243709 1.443833
H  -3.604698 3.299852 -0.369863
H  -1.398444 -3.183635 -2.116689
H  -0.404006 -1.769468 -2.531211
H  0.313863 -3.391985 -2.562663
H  0.970588 -2.632784 3.281357
H  2.354985 -3.95897 1.639558
H  3.081825 -1.852579 1.132428
