program: Gaussian 09
title: 000083119
version: EM64L-G09RevD.01
frameworkgroup: C1[X(C27H26N2O2)]
method: RPBEPBE
basis: SDD
operation: Freq
keyword: #p
keyword: freq=noraman
keyword: PBEPBE/SDD
title: #p freq=noraman PBEPBE/SDD
converged: YES YES NO NO
title: Mulliken charges:
elementType: O O N N C C C C C C C C C C C C C C C C C C C C C C C C C C C H H H H H H H H H H H H H H H H H H H H H H H H H H
charge: -0.307624 -0.307633 -0.701066 -0.701090 0.026956 0.460144 0.460109 -0.757828 -0.757833 -0.384622 -0.384291 -0.405277 -0.405357 -0.374031 -0.374406 -0.412372 -0.412616 0.315405 0.315749 0.319419 0.319834 -0.336848 -0.336851 -0.364970 -0.365422 -0.399063 -0.399103 -0.391857 -0.391836 0.502695 0.502647 0.234381 0.208327 0.229003 0.208336 0.228989 0.234412 0.243772 0.243815 0.245875 0.245864 0.261367 0.261413 0.249542 0.249589 0.258225 0.258296 0.250350 0.250371 0.217310 0.217283 0.218007 0.218000 0.304055 0.304233 0.304195 0.304023
chargesum: 0.00000
title: Mulliken charges with hydrogens summed into heavy atoms:
elementType: O O N N C C C C C C C C C C C C C C C C C C C C C C C C C C C
charge: -0.307624 -0.307633 -0.092779 -0.092872 0.026956 0.460144 0.460109 -0.086116 -0.086094 -0.140850 -0.140476 -0.159402 -0.159492 -0.112664 -0.112994 -0.162830 -0.163027 0.315405 0.315749 0.319419 0.319834 -0.078623 -0.078555 -0.114619 -0.115050 -0.181753 -0.181820 -0.173850 -0.173836 0.502695 0.502647
polarizability: 3.85326031e+02 2.05108859e-01 3.79464741e+02 -1.67575044e+01 -3.19045259e-02 2.22825295e+02
1716.lowfreq: -5.5075 -0.0005 -0.0002 0.0004 2.7242 6.1973 11.5939 19.2685 19.6262
frequency: 11.5719 19.2410 19.6059 24.3010 26.1229 39.3513 58.8092 62.7603 66.5536 93.9938 126.7730 134.9454 165.0271 187.0238 190.0060 225.5603 226.6204 279.5504 288.9075 296.3864 314.0049 320.8256 323.0025 323.6504 330.8659 331.6926 350.7916 350.9562 352.7206 366.0131 367.0678 375.8696 406.2733 410.8007 410.9783 414.2019 415.3719 416.5468 459.1134 477.3261 496.4757 499.6767 521.8576 543.7734 548.6679 575.1873 584.6940 616.5728 631.3653 632.5138 637.6191 650.6641 692.5618 710.4910 723.5093 733.5028 734.8737 745.0481 778.7464 804.0254 804.2453 811.2857 814.2531 824.1576 824.6798 829.6939 831.0883 838.1944 838.9227 853.8750 854.4101 918.2123 927.7859 931.2602 931.3422 943.9428 944.0501 952.8310 953.1718 968.5074 968.9527 995.5533 995.7209 1001.2963 1002.3744 1008.7989 1015.2779 1015.2860 1080.4498 1108.8899 1109.8727 1118.4457 1120.7415 1121.1456 1150.7811 1151.6828 1157.7002 1172.8099 1174.6283 1190.5790 1193.2767 1216.7338 1217.2610 1226.6469 1244.7502 1296.6067 1296.6213 1305.1372 1305.3634 1312.9409 1312.9942 1359.0390 1362.3701 1377.3914 1382.1809 1382.4816 1397.6135 1412.3375 1412.5796 1434.6149 1434.6748 1464.5216 1472.7064 1484.8270 1485.8489 1490.4929 1490.9799 1505.1586 1505.3245 1579.4105 1581.8989 1589.9699 1591.0978 1615.2412 1616.3416 1630.7015 1630.7897 1644.7854 1645.0469 2975.2439 2978.6687 3069.9202 3072.6085 3082.9666 3084.6109 3122.3545 3122.4063 3123.8455 3124.1731 3126.1490 3126.2023 3145.0786 3145.2575 3155.7558 3155.7642 3159.9653 3160.0297 3165.9843 3166.0220 3167.1000 3167.2907 3571.5307 3571.6088 3711.5431 3711.5877
redmass: 5.7668 4.1283 6.2316 4.5968 3.6759 5.3204 3.7251 5.2016 3.9231 4.3093 5.3260 5.0108 5.5054 5.3101 4.5065 3.8771 3.6352 1.1711 3.5887 2.9757 3.9479 1.2172 1.6088 1.8523 2.0937 1.9553 1.0650 1.0480 3.2122 5.0758 5.1637 4.1394 3.2914 2.9247 3.3136 3.0414 2.8364 3.0421 3.7812 3.4953 3.2351 3.0536 4.3901 3.9388 2.7813 2.8870 3.9139 5.6508 7.0129 6.8785 6.5259 5.9136 3.8430 3.7930 3.8562 3.9144 4.2861 4.6581 3.2111 1.2944 1.2734 3.7799 3.3856 2.0019 2.0134 1.3031 1.2813 1.6814 1.6868 6.0572 5.9314 2.3271 1.4947 1.3638 1.3640 1.3436 1.3448 1.3688 1.3324 1.3523 1.3504 2.7762 2.7724 2.0274 3.0787 1.6114 1.4237 1.4237 1.9038 1.8583 2.2389 1.3317 1.1912 1.2005 1.9511 1.8729 2.1699 1.2695 1.2540 1.5794 1.5021 2.5828 2.6308 3.7981 3.4798 1.3383 1.3391 1.2755 1.2867 3.2829 3.2857 5.8334 5.7149 1.2121 6.0942 6.2184 1.2373 3.5780 3.4546 3.5117 3.5126 1.0678 1.1310 1.3809 1.0513 2.3878 1.4631 2.9409 3.0181 7.1535 7.2441 7.3560 7.3946 6.0161 6.0409 2.5806 2.5676 1.6055 1.6118 1.0351 1.0359 1.0994 1.0995 1.0997 1.0995 1.0889 1.0889 1.0888 1.0889 1.0889 1.0889 1.0872 1.0872 1.0955 1.0955 1.0941 1.0942 1.0955 1.0955 1.0963 1.0963 1.0448 1.0448 1.1040 1.1040
irintensity: 0.0359 2.3775 0.0959 1.4951 0.3715 1.8083 0.2536 0.0430 0.0587 1.0071 0.0003 3.2869 0.9554 0.0607 2.3197 0.9561 0.4349 0.6835 1.3071 0.4968 8.2912 32.0592 21.1643 201.9112 31.8338 332.0476 0.8050 3.8809 0.8609 0.4294 10.6525 0.8140 6.5260 3.5287 0.0050 0.6564 0.7755 0.0037 2.3510 2.0983 35.9346 10.5827 11.2238 11.4769 20.1285 18.3840 4.1484 2.0530 1.5433 0.4106 1.9286 0.0477 1.7436 0.3035 6.1549 11.9027 2.3771 8.7991 7.6161 0.0552 1.6461 6.1795 51.3059 29.9474 112.8653 16.6576 5.3235 86.6410 11.8604 59.3616 26.2168 4.0890 1.8361 0.4437 0.9892 0.3150 0.1902 0.0005 0.1667 1.9858 0.0785 10.4364 7.2481 1.8933 27.3857 14.5093 0.0274 0.0448 35.5628 11.0897 3.7329 0.3307 38.2829 4.5578 22.8208 3.1805 5.4261 93.9504 18.9628 109.4352 96.4192 327.8645 331.0974 153.8911 79.7185 3.4583 0.8305 2.3854 2.0262 14.0362 21.0854 5.4235 1.0320 25.5932 16.2669 1.0233 18.5907 1.8489 0.0639 5.1164 1.9868 13.4725 36.7814 114.3569 26.6306 332.5509 275.4950 92.1136 286.1247 2.8743 2.1634 0.8111 3.6666 57.2419 41.8595 0.2447 0.5933 119.4162 327.6503 24.9612 35.9391 8.6464 72.2028 39.5316 41.2547 3.4031 25.6661 1.3338 36.4802 35.1008 33.6981 10.0549 10.2787 10.7628 9.3253 8.2093 7.7292 3.4400 3.1846 12.5034 5.7269 50.9734 106.0250 24.9922 15.1603
temp: 298.150 k
press: 1.00000 atm
elementType: 8 8 7 7 6 6 6 6 6 6 6 6 6 6 6 6 6 6 6 6 6 6 6 6 6 6 6 6 6 6 6 1 1 1 1 1 1 1 1 1 1 1 1 1 1 1 1 1 1 1 1 1 1 1 1 1 1
symmnumber: 1
zpe: 1203756.3 jmol-1
zpe.correction: 0.458487 hartree
zpe.thermalcorrener: 0.486969 hartree
zpe.thermalcorrenthalpy: 0.487913 hartree
zpe.thermalcorrgfe: 0.396214 hartree
zpe.sumelectzpe: -1302.228981 hartree
zpe.sumelectthermal: -1302.200498 hartree
zpe.sumelectthermalent: -1302.199554 hartree
zpe.sumelectthermalfe: -1302.291253 hartree
dipole: -0.0022 5.4555 0.0139
dipole: 5.4555
quadrupole: -159.5965 -137.9256 -181.0799
quadrupole: 0.0392 -27.0172 0.0255
quadrupole: -0.0625 21.6084 -21.5459 0.0392 -27.0172 0.0255
hfenergy: -1302.6874673 hartree
pointgroup: C01 [X(C27H26N2O2)]
dipole: 0.0136825 -2.1463142 0.0053102 debye
polarizability: 384.0594123|0.2299538|379.4673484|22.0133427|0.1845029|224.0893074 unknown
InChI: InChI=1S/C27H26N2O2/c1-27(2,19-3-11-23(12-4-19)30-25-15-7-21(28)8-16-25)20-5-13-24(14-6-20)31-26-17-9-22(29)10-18-26/h3-18H,28-29H2,1-2H3
charge 0 multiplicity 1
57 atoms
O  4.746379 0.323058 -1.030469
O  -4.759002 0.270615 1.025122
N  6.22588 -4.529582 1.484333
N  -6.185176 -4.603485 -1.478783
C  -0.022896 3.482621 0.002315
C  1.212381 2.60171 -0.31537
C  -1.248641 2.587538 0.317581
C  0.357036 4.404513 1.199819
C  -0.412783 4.403536 -1.192837
C  1.591314 1.577421 0.592735
C  -1.616335 1.561775 -0.593501
C  2.036182 2.805418 -1.451498
C  -2.074745 2.779244 1.454097
C  2.741182 0.787353 0.391246
C  -2.757692 0.758824 -0.394562
C  3.188898 2.022591 -1.676534
C  -3.219064 1.983478 1.676546
C  3.543539 1.016868 -0.752261
C  -3.562761 0.976649 0.749368
C  5.047905 -0.888416 -0.340832
C  -5.046592 -0.945493 0.337838
C  4.197677 -2.015104 -0.404928
C  -4.180613 -2.060412 0.397547
C  6.291588 -0.974848 0.317614
C  -6.292878 -1.049433 -0.313142
C  4.587077 -3.223344 0.205116
C  -4.557013 -3.27417 -0.209719
C  6.687994 -2.185317 0.921091
C  -6.676158 -2.265538 -0.913723
C  5.839068 -3.329334 0.880333
C  -5.811321 -3.397703 -0.877572
H  1.262893 4.982794 0.945262
H  -0.451355 5.124141 1.427484
H  0.576384 3.821204 2.111889
H  0.387497 5.132902 -1.418083
H  -0.625124 3.82033 -2.106628
H  -1.325201 4.97088 -0.937133
H  0.966599 1.386875 1.473613
H  -0.989275 1.380521 -1.474658
H  1.783687 3.580174 -2.181567
H  -1.830727 3.554634 2.186344
H  3.014538 0.011886 1.113149
H  -3.022793 -0.017326 -1.118801
H  3.82298 2.180488 -2.554409
H  -3.855098 2.132187 2.554608
H  3.24123 -1.94826 -0.934094
H  -3.222228 -1.980478 0.921355
H  6.940909 -0.094312 0.344782
H  -6.954376 -0.177913 -0.336806
H  3.922606 -4.094419 0.151924
H  -3.880381 -4.136032 -0.159918
H  7.65841 -2.245734 1.428508
H  -7.648658 -2.339619 -1.415304
H  5.624795 -5.347008 1.451533
H  7.118002 -4.607825 1.96255
H  -7.079265 -4.69437 -1.951055
H  -5.572879 -5.412657 -1.449017
