program: Gaussian 09
title: 000082716
version: EM64L-G09RevD.01
frameworkgroup: C1[X(C16H18O2)]
method: RPBEPBE
basis: SDD
operation: Freq
keyword: #pfreq=noraman
keyword: PBEPBE/SDD
title: #p freq=noraman PBEPBE/SDD
converged: YES YES NO NO
title: Mulliken charges:
elementType: O O C C C C C C C C C C C C C C C C H H H H H H H H H H H H H H H H H H
charge: -0.267092 -0.267656 -0.353488 0.447771 0.522001 -0.746664 -0.361986 -0.440081 -0.429020 -0.387623 -0.363894 -0.356741 -0.372981 -0.355493 0.311950 0.310574 -0.537788 -0.538590 0.218269 0.218828 0.218370 0.235304 0.242509 0.232777 0.243512 0.244584 0.247540 0.247243 0.235868 0.237131 0.219552 0.218670 0.243834 0.243438 0.220173 0.219202
chargesum: 0.00000
title: Mulliken charges with hydrogens summed into heavy atoms:
elementType: O O C C C C C C C C C C C C C C C C
charge: -0.267092 -0.267656 -0.135219 0.447771 0.522001 -0.074163 -0.119478 -0.207304 -0.185508 -0.143039 -0.116354 -0.109498 -0.137113 -0.118362 0.311950 0.310574 0.144268 0.144222
polarizability: 2.48513621e+02 -3.09945335e+00 1.61069272e+02 -1.81067038e+01 2.93296669e+00 1.36655069e+02
1716.lowfreq: -10.6918 -2.1739 -0.0007 -0.0002 0.0003 3.8807 22.9585 33.0732 37.7243
frequency: 22.9172 32.8074 37.6659 74.8268 92.6318 121.9878 147.4603 156.3803 188.4157 218.6718 232.9005 255.8337 258.6133 281.7055 295.5258 331.1982 335.9673 411.6211 414.6405 422.9015 445.4071 483.7838 500.9308 522.8148 551.8004 570.7376 626.9285 632.3625 681.1951 722.4117 737.6288 746.9599 786.6509 813.3711 814.8035 818.3785 834.7250 840.4402 937.7754 944.6024 962.2188 968.7710 981.6025 989.3449 990.8968 1000.4482 1005.8041 1044.4970 1064.5254 1109.4079 1112.3418 1112.7173 1120.4982 1155.8809 1156.2360 1175.0028 1179.6676 1193.8811 1210.0534 1227.1825 1229.7051 1267.8811 1295.8226 1309.9045 1312.3478 1373.6454 1384.3817 1386.9715 1415.6032 1417.5739 1435.7264 1436.3098 1465.5766 1466.1236 1472.8344 1473.1826 1475.2989 1482.3431 1499.3731 1501.7879 1580.6417 1584.8243 1621.7493 1624.6511 2955.2640 2955.8605 2957.2432 2977.2643 3041.1699 3041.9513 3073.0850 3082.2692 3115.0689 3121.8843 3122.0290 3125.0806 3127.5264 3138.1946 3157.8701 3159.9246 3164.1629 3164.6300
redmass: 3.5790 4.0647 4.0586 3.3237 3.5686 3.6369 4.0554 3.6234 3.3063 1.5585 1.3128 1.8474 2.6703 1.3577 2.2540 4.4325 4.3650 2.9720 2.9493 4.4504 4.1227 3.6005 3.3291 3.8504 2.3968 3.7132 6.3831 7.0514 3.2884 3.9657 3.3947 3.5276 4.8181 1.8486 2.0284 1.3590 1.5602 1.5847 1.3507 1.3628 1.3551 1.3540 2.6807 8.2867 5.4946 2.8003 2.2732 1.5632 2.4326 1.3541 1.2615 1.2605 1.3652 1.3491 1.3360 1.2861 1.3143 2.5105 1.7891 3.2713 2.9050 1.7006 1.4669 1.3572 1.3737 4.6799 2.2175 1.6737 3.4514 3.3038 1.1683 1.1729 1.0503 1.0501 1.0770 1.0761 1.0519 1.0755 2.3161 2.4221 7.1289 7.0858 6.4131 6.3214 1.0333 1.0334 1.0822 1.0354 1.1037 1.1038 1.1002 1.0992 1.0895 1.0988 1.0990 1.0891 1.0887 1.0871 1.0940 1.0948 1.0949 1.0956
irintensity: 0.6596 0.5133 0.9723 3.0381 3.9905 2.8953 1.6298 3.1138 2.4523 1.2069 0.2615 1.1724 2.0260 1.0005 1.7911 0.2218 2.0939 0.5089 0.1098 0.4643 0.7039 0.7861 4.8592 21.2113 35.2870 17.7496 1.7814 0.1479 1.9031 19.4793 0.9154 2.4996 8.5566 13.1962 9.5556 12.2772 58.7759 48.0844 0.1125 0.7272 0.2836 0.1104 15.6517 50.5607 26.8075 24.0484 4.4946 10.0890 9.8932 9.9193 0.4188 0.2852 14.6796 0.3436 0.2502 122.8835 50.7067 2.3965 9.3144 138.6374 162.9980 8.0976 13.3525 0.4982 8.8890 14.1482 9.5355 16.8785 2.6130 8.4814 8.9592 11.4322 12.6238 13.0964 83.7981 42.4112 7.9762 2.4939 171.1196 74.2225 8.1969 21.3882 43.2839 29.0436 73.7411 73.1144 12.1902 28.5782 51.4972 50.4717 44.4461 36.7558 17.2649 39.4767 24.1552 12.0422 8.1204 10.2730 14.8682 21.2236 7.6824 2.7381
temp: 298.150 k
press: 1.00000 atm
elementType: 8 8 6 6 6 6 6 6 6 6 6 6 6 6 6 6 6 6 1 1 1 1 1 1 1 1 1 1 1 1 1 1 1 1 1 1
symmnumber: 1
zpe: 778195.3 jmol-1
zpe.correction: 0.296399 hartree
zpe.thermalcorrener: 0.313708 hartree
zpe.thermalcorrenthalpy: 0.314652 hartree
zpe.thermalcorrgfe: 0.249954 hartree
zpe.sumelectzpe: -769.605752 hartree
zpe.sumelectthermal: -769.588443 hartree
zpe.sumelectthermalent: -769.587499 hartree
zpe.sumelectthermalfe: -769.652197 hartree
dipole: 1.0614 -0.5708 -2.3712
dipole: 2.6599
quadrupole: -95.1931 -100.5844 -103.5011
quadrupole: 5.9069 -5.0745 5.4489
quadrupole: 4.5665 -0.8249 -3.7416 5.9069 -5.0745 5.4489
hfenergy: -769.9021512 hartree
pointgroup: C01 [X(C16H18O2)]
dipole: -0.3736443 -0.4078759 0.8883335 debye
polarizability: 246.635454|8.3748753|161.5837414|-21.6616204|1.1832207|138.0187657 unknown
InChI: InChI=1S/C16H18O2/c1-12(13-4-8-15(17-2)9-5-13)14-6-10-16(18-3)11-7-14/h4-12H,1-3H3
charge 0 multiplicity 1
36 atoms
O  -4.699984 -1.567768 -0.487104
O  5.008575 -1.021255 -0.475863
C  -0.015987 1.76099 0.256769
C  -1.271801 0.88241 0.137571
C  1.282884 0.966715 0.044781
C  0.068274 2.558741 1.58476
C  -1.500127 0.164752 -1.071592
C  2.345825 1.519054 -0.717878
C  -2.236724 0.758438 1.162303
C  1.487865 -0.296744 0.647922
C  -2.639706 -0.634978 -1.250319
C  3.568953 0.840372 -0.873697
C  -3.393385 -0.045399 1.005448
C  2.707938 -0.995813 0.505415
C  -3.595581 -0.74364 -0.207355
C  3.754454 -0.42237 -0.258897
C  -5.71464 -1.708519 0.557859
C  5.242963 -2.329637 0.136464
H  -0.066197 2.510153 -0.562003
H  0.136724 1.880322 2.455188
H  -0.811133 3.21552 1.718905
H  0.972955 3.191536 1.586552
H  -0.762052 0.23291 -1.879998
H  2.212528 2.4959 -1.20025
H  -2.102426 1.294512 2.10749
H  0.676101 -0.752853 1.226906
H  -2.814466 -1.183512 -2.181083
H  4.387456 1.261766 -1.465424
H  -4.116286 -0.111765 1.824499
H  2.826783 -1.973195 0.983275
H  -6.179445 -0.733371 0.803722
H  -5.28855 -2.156053 1.477465
H  -6.472962 -2.383743 0.134698
H  6.265804 -2.606775 -0.158645
H  4.527898 -3.086625 -0.241503
H  5.175171 -2.277375 1.241019
