program: Gaussian 09
title: 000082646
version: EM64L-G09RevD.01
frameworkgroup: C1[X(C6HCl4NO2)]
method: RPBEPBE
basis: SDD
operation: Freq
keyword: #p
keyword: freq=noraman
keyword: PBEPBE/SDD
title: #p freq=noraman PBEPBE/SDD
converged: YES YES NO NO
title: Mulliken charges:
elementType: Cl Cl Cl Cl O O N C C C C C C H
charge: 0.059520 0.071478 0.065361 0.050851 -0.377832 -0.197955 0.109453 0.116119 -0.202696 0.111477 0.007881 -0.340597 0.132475 0.394465
chargesum: 0.00000
title: Mulliken charges with hydrogens summed into heavy atoms:
elementType: Cl Cl Cl Cl O O N C C C C C C
charge: 0.059520 0.071478 0.065361 0.050851 0.016632 -0.197955 0.109453 0.116119 -0.202696 0.111477 0.007881 -0.340597 0.132475
polarizability: 1.69105659e+02 7.08217813e+00 1.42899744e+02 2.05516614e+00 2.43889733e+00 4.90161293e+01
1716.lowfreq: -0.0018 0.0030 0.0032 1.6811 5.7925 5.8861 32.1880 47.9967 75.1449
frequency: 32.1671 47.9923 75.1439 115.8772 142.2431 194.1524 199.0538 207.5290 252.4138 290.6492 300.7749 320.5712 341.9886 395.8108 488.2350 498.8888 565.8854 570.6695 605.0604 643.3005 666.1714 718.8460 767.4615 784.1478 860.7411 1007.3397 1054.9205 1191.1794 1278.2152 1283.6797 1320.0347 1373.8421 1480.8132 1520.7450 1649.4836 3511.5869
redmass: 11.4372 19.7097 32.9690 12.4328 10.4414 30.2939 25.2375 34.2665 12.1217 14.4841 13.1168 28.0196 25.3980 9.9026 6.3752 9.1518 6.3055 11.8118 1.6105 5.8377 7.4240 8.4066 12.5325 12.0991 11.5920 10.1884 3.3660 4.2659 3.4437 11.7173 11.7181 6.9653 12.0168 12.4500 10.1509 1.0641
irintensity: 1.7716 0.1836 0.0391 0.7896 0.7767 0.1486 0.0118 0.0106 0.5503 0.5901 0.8484 0.8811 1.6471 0.2031 5.0033 22.0437 75.0627 1.8762 142.7229 22.4732 43.9888 21.0088 42.0720 13.8759 5.9913 88.0513 229.5715 70.4001 188.0801 134.2914 37.6135 67.6625 31.5864 15.1052 213.9974 51.0448
temp: 298.150 k
press: 1.00000 atm
elementType: 17 17 17 17 8 8 7 6 6 6 6 6 6 1
symmnumber: 1
zpe: 160046.1 jmol-1
zpe.correction: 0.060958 hartree
zpe.thermalcorrener: 0.073456 hartree
zpe.thermalcorrenthalpy: 0.074400 hartree
zpe.thermalcorrgfe: 0.019586 hartree
zpe.sumelectzpe: -2273.721423 hartree
zpe.sumelectthermal: -2273.708926 hartree
zpe.sumelectthermalent: -2273.707982 hartree
zpe.sumelectthermalfe: -2273.762796 hartree
dipole: 0.1443 0.4139 -0.9675
dipole: 1.0621
quadrupole: -97.7737 -100.0668 -102.1415
quadrupole: -7.1553 -5.6755 0.0193
quadrupole: 2.2203 -0.0728 -2.1475 -7.1553 -5.6755 0.0193
hfenergy: -2273.7823814 hartree
pointgroup: C01 [X(C6H1Cl4N1O2)]
dipole: -0.0091139 -0.177441 -0.3782194 debye
dipolederiv: -0.2015061 -0.3108282 -0.0274162 -0.351853 -0.5266101 -0.0246058 -0.0333431 -0.044252 0.0243056 -0.1278172 0.2637675 0.0003076 0.2484156 -0.4949835 -0.0025962 0.0023251 -0.0052776 0.025325 -0.7928312 -0.0036514 -0.019191 0.0430332 0.0010898 0.0000384 -0.0178939 0.0013023 0.0245219 -0.2652369 -0.3510362 -0.0064457 -0.3976207 -0.6764528 -0.0135749 -0.0074671 -0.0164962 -0.0290205 -0.549413 0.3096051 -0.3146095 0.320822 -0.7162366 0.3421073 -0.36321 0.3430984 -0.7211958 -0.8961035 -0.0696614 0.2515884 0.0213283 -0.4384534 0.230673 0.0204253 0.2344658 -0.6025675 -0.5692783 -0.3946001 0.0121257 0.154212 -0.4549023 -0.0067112 -0.0637568 -0.0153526 -0.1206715 -0.039092 0.1157731 -0.0100545 -0.1930453 0.0916409 0.0443757 0.0340594 0.0380023 0.0437531 0.1603861 0.5126354 0.0323983 0.6182483 0.5957546 0.0477199 0.0662191 0.0419823 -0.0033117 0.0852623 -0.4595895 -0.0115589 -0.495655 0.7497005 -0.004214 -0.022531 -0.0049635 -0.0010245 1.0767774 0.0314148 0.0294301 -0.2095511 -0.4523053 -0.0088197 0.0224393 -0.0031205 0.0170089 0.3764976 0.7186809 0.009284 0.6176329 1.1976645 0.0229166 0.0138978 0.0251169 0.0315848 1.5734361 -0.3414056 -0.0325024 -0.3287871 0.7677996 -0.6670101 0.1994191 -0.6069383 0.9671597 0.1689186 -0.0211045 0.086644 -0.04718 0.3562943 0.0397011 0.1494169 0.0124327 0.3441325 unknown
polarizability: 164.6027737|12.2459425|147.3022565|1.1022339|-4.09178|49.1165021 unknown
InChI: InChI=1S/C6HCl4NO2/c7-1-2(8)4(6(12)13)11-5(10)3(1)9/h12H
charge 0 multiplicity 1
14 atoms
Cl -1.311059 -2.579258 -0.101428
Cl 1.912606 -2.711656 -0.006687
Cl 3.614449 0.040729 0.07119
Cl 1.988838 2.870615 0.046048
O  -2.88887 1.309807 -0.924556
O  -3.233587 -0.219797 0.794679
N  -0.229192 1.349828 -0.022121
C  -0.966755 0.204762 -0.036182
C  -0.343941 -1.068084 -0.027338
C  1.075348 -1.1296 -0.001127
C  1.824899 0.071901 0.027258
C  1.10235 1.294299 0.014819
C  -2.465186 0.376889 0.012521
H  -3.870401 1.453167 -0.830876
