program: Gaussian 09
title: 000082611
version: EM64L-G09RevD.01
frameworkgroup: C1[X(C6H9NO)]
method: RPBEPBE
basis: SDD
operation: Freq
keyword: #pfreq=noraman
keyword: PBEPBE/SDD
title: #p freq=noraman PBEPBE/SDD
converged: YES YES NO NO
title: Mulliken charges:
elementType: O N C C C C C C H H H H H H H H H
charge: -0.203997 -0.015684 -0.366361 -0.465108 -0.417541 0.218714 -0.761480 -0.152153 0.242859 0.244532 0.229787 0.229388 0.242713 0.242686 0.261223 0.235573 0.234850
chargesum: 0.00000
title: Mulliken charges with hydrogens summed into heavy atoms:
elementType: O N C C C C C C
charge: -0.203997 -0.015684 0.121030 -0.005933 0.067858 0.218714 -0.029835 -0.152153
polarizability: 9.06741502e+01 -8.23710802e+00 6.73551958e+01 -4.22170118e-02 2.67879004e-02 4.91964716e+01
1716.lowfreq: -60.6409 -0.0004 -0.0004 -0.0003 6.3690 9.2753 19.5020 52.8438 79.3442
frequency: -60.2857 52.6553 79.0313 92.1461 111.2848 207.6195 288.7139 372.8625 384.2759 459.8436 520.0589 588.4648 718.3590 802.7772 809.8317 930.1474 943.6577 946.9237 1039.5331 1074.5105 1082.5422 1154.3896 1170.8159 1255.6657 1261.7376 1288.0697 1322.0856 1357.7677 1368.9728 1431.9705 1443.2445 1449.8796 1454.5485 1475.5633 1639.8959 2199.1291 2960.0095 2981.7840 2985.2032 3005.4795 3027.8627 3036.4947 3064.3782 3092.2380 3123.7896
redmass: 1.1771 2.8401 2.4599 6.4688 1.9891 4.9340 5.5582 3.4883 3.2904 2.0369 5.3574 4.3920 1.1568 1.3739 3.9838 2.0886 4.0195 1.3221 3.5628 2.7854 1.9291 1.2699 2.0605 1.4590 1.1945 1.0651 1.5538 1.6314 1.2476 1.0805 1.0838 1.0819 1.0498 1.0870 7.6558 12.4416 1.0597 1.0379 1.0586 1.0977 1.0607 1.1007 1.0964 1.1042 1.0997
irintensity: 0.0177 1.1357 0.3610 2.0569 0.7778 9.3401 3.0002 0.4313 0.9280 0.5402 16.8686 0.5908 8.4464 0.1396 1.2623 7.4642 0.1270 2.9361 1.6205 0.6855 1.2571 0.3826 45.2871 57.7184 0.1347 0.0016 21.6596 26.5661 62.5106 4.1245 24.7109 19.3624 22.8314 17.7858 100.0358 11.1696 15.4037 6.5819 10.8523 10.2064 10.6627 3.7651 12.7677 26.5071 12.4420
temp: 298.150 k
press: 1.00000 atm
elementType: 8 7 6 6 6 6 6 6 1 1 1 1 1 1 1 1 1
symmnumber: 1
zpe: 359215.9 jmol-1
zpe.correction: 0.136818 hartree
zpe.thermalcorrener: 0.145617 hartree
zpe.thermalcorrenthalpy: 0.146561 hartree
zpe.thermalcorrgfe: 0.102106 hartree
zpe.sumelectzpe: -363.374706 hartree
zpe.sumelectthermal: -363.365907 hartree
zpe.sumelectthermalent: -363.364963 hartree
zpe.sumelectthermalfe: -363.409418 hartree
dipole: 3.9670 -4.8900 -0.0116
dipole: 6.2967
quadrupole: -66.2786 -51.5689 -45.9123
quadrupole: -0.2842 0.1729 0.0223
quadrupole: -11.6920 3.0177 8.6743 -0.2842 0.1729 0.0223
hfenergy: -363.5115241 hartree
pointgroup: C01 [X(C6H9N1O1)]
dipole: -1.5596269 -1.9244719 0.0336499 debye
dipolederiv: -0.6324394 -0.012539 -0.0002344 0.0129069 -0.8489333 0.0031023 -0.0007731 0.00387 -0.2767957 -0.3335766 0.0029173 -0.0001265 -0.077748 -0.2287958 -0.0001485 0.002791 -0.0001811 -0.2356391 0.1299295 -0.039663 0.0008526 -0.1138051 0.0149132 0.0031188 0.0043747 0.0012633 0.139509 -0.3742381 0.1587652 -0.0028922 0.3273643 -0.1497256 0.0050447 -0.0088043 0.0076896 0.1706439 -0.0450042 -0.0541961 0.0027095 -0.0399835 0.1497751 0.0033206 0.0018129 0.0036415 0.2569411 1.1814477 0.0098537 0.0050088 -0.0769281 0.9858955 -0.0053556 0.0070673 -0.0062936 0.0647857 -0.4759891 -0.2033768 -0.0010822 -0.1969345 -0.1596778 -0.0014372 -0.0043509 -0.0027065 0.0378704 0.1170661 0.1230587 -0.0039365 0.1999166 -0.0044302 -0.0020495 -0.0066295 -0.0019924 -0.0631904 0.0538803 0.0081368 0.0080221 -0.0090356 0.0231151 0.0843932 0.0034771 0.0865979 -0.0435866 0.0562603 0.0078062 -0.0087681 -0.0104681 0.0147748 -0.0865698 -0.0038508 -0.0882112 -0.0318494 0.0484325 0.0024993 0.021313 -0.0506734 0.0200505 0.0917009 0.0218223 0.1199432 -0.0391473 0.0467974 -0.0006504 -0.0226452 -0.0540751 0.0099204 -0.0939343 -0.0190013 -0.1235559 -0.0294356 0.0459295 -0.0327327 -0.0032995 -0.0089389 0.0210588 -0.0791586 0.006933 -0.1078125 -0.0083015 0.0461115 -0.0316926 0.0047438 -0.0088946 0.0318054 0.0770903 -0.0065471 0.1056805 -0.0190438 -0.0563919 0.0574186 0.0009568 0.1113284 0.020691 -0.0006954 0.000952 0.0000865 0.1246134 0.0956647 0.0017948 0.0395963 -0.0022527 0.0511174 -0.1017953 -0.0120462 -0.114492 -0.0243254 0.0961199 0.0026 -0.0402182 -0.0017787 0.0484454 0.1033732 0.0127727 0.1164726 -0.0230488 unknown
polarizability: 90.6642372|8.2470223|67.3602097|-0.2844753|-0.2796326|49.2013708 unknown
InChI: InChI=1S/C6H9NO/c1-6(8)4-2-3-5-7/h2-4H2,1H3
charge 0 multiplicity 1
17 atoms
O  -2.114334 1.428995 -0.008767
N  3.927129 0.513687 -0.039941
C  0.384109 0.109155 -0.015524
C  -0.923044 -0.703528 0.009473
C  1.622636 -0.828195 0.008167
C  -2.184405 0.172582 -0.000671
C  -3.521444 -0.560267 -0.001747
C  2.898752 -0.091524 -0.017633
H  0.411273 0.746472 -0.916599
H  0.413555 0.796296 0.847783
H  -0.966798 -1.354942 0.908202
H  -0.977218 -1.395566 -0.857384
H  1.59935 -1.514468 -0.861194
H  1.604916 -1.462376 0.916387
H  -4.351043 0.163109 0.002811
H  -3.606985 -1.209101 -0.894172
H  -3.604348 -1.218827 0.88371
