program: Gaussian 09
title: 000082604
version: EM64L-G09RevD.01
frameworkgroup: C1[X(C6H4ClNO)]
method: RPBEPBE
basis: SDD
operation: Freq
keyword: #p
keyword: freq=noraman
keyword: PBEPBE/SDD
title: #p freq=noraman PBEPBE/SDD
converged: NO YES NO YES
title: Mulliken charges:
elementType: Cl O N C C C C C C H H H H
charge: -0.077485 -0.106860 0.004177 0.401502 -0.248680 -0.388923 -0.167477 -0.306113 -0.174316 0.281854 0.279564 0.246212 0.256545
chargesum: 0.00000
title: Mulliken charges with hydrogens summed into heavy atoms:
elementType: Cl O N C C C C C C
charge: -0.077485 -0.106860 0.004177 0.401502 0.033174 -0.109360 0.078735 -0.049568 -0.174316
polarizability: 1.18892459e+02 -3.70469891e+00 8.97277548e+01 -1.45870359e-03 1.17055358e-02 3.10916622e+01
1716.lowfreq: -8.9895 -8.8312 -0.0027 0.0014 0.0020 4.1391 41.9593 148.5727 178.2600
frequency: 41.9577 148.5722 178.2561 301.6613 353.5319 383.5787 411.8620 481.0622 608.1382 640.5964 675.1649 708.5183 828.1469 849.2238 935.5385 968.5618 1001.1887 1003.8928 1027.8543 1116.8530 1194.3923 1216.3983 1315.2881 1330.2443 1410.8869 1450.8505 1545.9635 1577.2171 1704.9614 3143.9065 3159.1863 3164.7152 3179.5368
redmass: 6.9061 4.8013 9.1530 8.4004 2.8997 15.5992 4.6224 10.0307 8.0773 6.9289 8.5876 1.9028 1.6175 8.4679 1.4149 1.4926 3.6373 1.3902 3.2726 1.6089 1.6547 2.1514 10.5101 1.2468 2.1162 2.0532 5.4732 5.8808 12.9913 1.0889 1.0918 1.0928 1.1007
irintensity: 2.0405 1.4758 3.0690 21.4145 0.2214 8.1338 2.8530 2.3838 4.2595 8.4614 82.4250 45.1089 29.6466 158.4687 2.4040 2.2574 10.9727 0.5393 8.7405 12.5880 37.2809 132.9638 3.4248 6.6521 35.3154 10.2428 6.3131 63.4610 269.0056 7.4001 4.2689 0.9361 14.1033
temp: 298.150 k
press: 1.00000 atm
elementType: 17 8 7 6 6 6 6 6 6 1 1 1 1
symmnumber: 1
zpe: 227635.6 jmol-1
zpe.correction: 0.086702 hartree
zpe.thermalcorrener: 0.094222 hartree
zpe.thermalcorrenthalpy: 0.095166 hartree
zpe.thermalcorrgfe: 0.053250 hartree
zpe.sumelectzpe: -820.434974 hartree
zpe.sumelectthermal: -820.427454 hartree
zpe.sumelectthermalent: -820.426510 hartree
zpe.sumelectthermalfe: -820.468426 hartree
dipole: -3.6089 1.4282 0.0005
dipole: 3.8812
quadrupole: -57.4919 -61.4775 -59.3082
quadrupole: -8.6093 -0.0029 0.0005
quadrupole: 1.9340 -2.0516 0.1177 -8.6093 -0.0029 0.0005
hfenergy: -820.5216763 hartree
pointgroup: C01 [X(C6H4Cl1N1O1)]
dipole: 1.3081777 0.7876429 -0.0001872 debye
dipolederiv: -0.5555698 -0.3598477 -0.0000083 -0.5110997 -0.7565034 -0.000014 -0.0000013 -0.0000052 -0.1305462 -0.737795 0.282098 -0.0000188 0.1591662 -1.0292809 0.0000086 -0.0000585 0.000095 -0.2323579 -0.5234202 -0.1307457 0.0000423 -0.1325013 -0.3079207 0.0000256 0.000066 0.0000373 -0.2470554 -0.8123138 0.0373221 -0.0000277 -0.1914978 -0.2919057 0.0000502 -0.0000022 0.0000734 0.0474455 0.2406604 -0.138039 0.0000296 0.212234 0.1200524 -0.0000491 -0.0000307 -0.0000477 -0.0681509 0.2981213 0.0341965 -0.0000288 -0.0637807 0.1879794 -0.000086 -0.0000311 -0.0000611 -0.0134861 -0.2879407 0.2036622 -0.0000587 0.3130967 -0.0754951 -0.0000106 -0.0000483 -0.0000249 -0.1006638 0.4160833 0.0440529 -0.0000389 -0.1335633 0.245311 -0.0000814 0.000015 -0.0000922 -0.0361825 1.8599366 0.1067594 0.0000627 0.4711353 1.7315493 0.0000242 0.000059 -0.0000808 0.193683 0.101169 0.0798136 -0.0000198 0.0336479 0.0332851 0.0000383 -0.000025 0.0000311 0.1516322 0.0736325 -0.0615246 0.0000268 -0.0694624 0.0599434 0.0000288 0.0000384 -0.0000007 0.1345537 0.0213747 -0.0814933 0.0000248 -0.0943743 -0.0151346 0.0000548 0.0000276 0.000055 0.1639177 -0.0939385 -0.0162544 0.0000148 0.0069994 0.0981198 0.0000105 -0.000009 0.0000208 0.1372108 unknown
polarizability: 116.9030701|8.2332906|91.717144|0.0004853|-0.0117861|31.0916622 unknown
InChI: InChI=1S/C6H4ClNO/c7-6(9)5-2-1-3-8-4-5/h1-4H
charge 0 multiplicity 1
13 atoms
Cl -2.722666 -1.377999 -0.000061
O  -2.362376 1.319046 -0.000179
N  1.739417 -1.315987 0.000408
C  -0.268901 0.082554 0.00002
C  0.531444 1.260623 -0.000321
C  0.384038 -1.179378 0.000416
C  1.931657 1.128424 -0.000322
C  2.489477 -0.172879 0.000033
C  -1.741359 0.256584 -0.000035
H  0.045429 2.241363 -0.000594
H  -0.198085 -2.105529 0.000703
H  2.582978 2.006975 -0.000596
H  3.575249 -0.318698 0.000027
