program: Gaussian 09
title: 000082558
version: EM64L-G09RevD.01
frameworkgroup: C1[X(C8H7N)]
method: RPBEPBE
basis: SDD
operation: Freq
keyword: #p
keyword: freq=noraman
keyword: PBEPBE/SDD
title: #p freq=noraman PBEPBE/SDD
converged: NO YES NO YES
title: Mulliken charges:
elementType: N C C C C C C C C H H H H H H H
charge: 0.022548 0.448360 -0.563026 -0.354577 -0.354567 -0.219604 -0.219613 -0.229626 -0.190171 0.247339 0.247396 0.234791 0.234789 0.231343 0.231342 0.233276
chargesum: 0.00000
title: Mulliken charges with hydrogens summed into heavy atoms:
elementType: N C C C C C C C C
charge: 0.022548 0.448360 -0.068291 -0.119786 -0.119778 0.011739 0.011729 0.003649 -0.190171
polarizability: 1.10102765e+02 -7.93400709e-03 8.50321395e+01 -2.53171576e+00 -3.86874841e-03 5.64740246e+01
1716.lowfreq: -17.9323 -8.6358 -7.0270 -0.0006 -0.0004 0.0005 18.6007 94.9722 232.5126
frequency: -14.9147 94.9721 232.5106 293.7458 321.0578 372.9978 401.2520 479.0679 603.4544 616.5758 703.0379 751.2903 816.6587 852.4380 908.1678 938.1603 939.3101 977.3917 990.5003 999.9522 1025.2476 1088.2168 1174.8830 1188.4547 1209.2962 1229.0055 1327.4898 1331.2102 1384.6213 1441.8777 1468.4619 1484.7354 1597.5745 1613.7575 2081.5384 2996.0388 3047.4970 3122.0952 3122.6201 3136.7893 3150.0756 3166.5529
redmass: 4.1641 6.7247 5.3999 7.5458 2.0444 7.4651 2.7873 3.7506 4.7635 6.3498 1.8148 2.0454 3.4611 1.2482 2.6284 1.6754 2.1215 1.3946 6.1661 1.3288 2.2266 1.5342 1.0539 1.1231 2.7662 1.1367 1.2589 1.3017 8.1488 2.1650 1.1432 2.0722 6.1317 6.1268 12.2968 1.0584 1.1033 1.0864 1.0888 1.0912 1.0960 1.1016
irintensity: 4.0747 3.7513 1.8116 0.0927 1.7355 1.0488 0.0129 6.4324 19.3153 0.1667 51.0464 59.6953 11.7887 0.0006 10.1479 1.3078 0.0444 0.0081 0.6689 0.0636 4.1668 7.6355 0.0184 0.2254 7.3877 1.8385 0.0812 11.4318 0.4814 8.8496 21.2085 4.6537 1.1146 0.9967 120.4817 23.0754 7.1917 6.4279 3.2870 10.0406 35.1085 17.2554
temp: 298.150 k
press: 1.00000 atm
elementType: 7 6 6 6 6 6 6 6 6 1 1 1 1 1 1 1
symmnumber: 1
zpe: 327062.5 jmol-1
zpe.correction: 0.124572 hartree
zpe.thermalcorrener: 0.131459 hartree
zpe.thermalcorrenthalpy: 0.132403 hartree
zpe.thermalcorrgfe: 0.093039 hartree
zpe.sumelectzpe: -363.121199 hartree
zpe.sumelectthermal: -363.114312 hartree
zpe.sumelectthermalent: -363.113367 hartree
zpe.sumelectthermalfe: -363.152731 hartree
dipole: 3.1430 -0.0010 2.8000
dipole: 4.2093
quadrupole: -60.6566 -45.8753 -57.5300
quadrupole: 0.0048 -11.9886 0.0040
quadrupole: -5.9693 8.8120 -2.8427 0.0048 -11.9886 0.0040
hfenergy: -363.2457704 hartree
pointgroup: C01 [X(C8H7N1)]
dipole: -1.2893602 -0.0000187 1.0392838 debye
dipolederiv: -0.8163195 0.0005371 0.3251656 0.0006821 -0.1329268 -0.0007087 0.4947129 -0.0006222 -0.5728424 0.172287 -0.0000322 0.050314 0.0000092 -0.0036622 0.0000932 -0.0104059 0.0000231 -0.1474467 0.5930064 0.0000504 -0.029983 -0.0001787 0.3229775 0.000072 -0.0812886 -0.0000599 0.4114231 -0.1020278 0.0837429 0.0403712 0.0399294 0.0453872 0.0209063 0.0151107 0.0165349 -0.1297664 -0.1020735 -0.083731 0.0403257 -0.0398866 0.0454151 -0.0208062 0.0150926 -0.0164165 -0.1297926 -0.0449664 -0.0901933 0.0373389 -0.08477 0.0816614 -0.0266418 0.0429067 -0.033708 -0.122681 -0.0449395 0.0901773 0.037417 0.0847424 0.0815984 0.02678 0.0429684 0.0338487 -0.1226358 0.0730941 -0.0000268 0.0949088 -0.000024 -0.059865 0.0000208 0.0857765 0.0000191 -0.1206147 0.1949173 -0.0006187 -0.3707603 -0.0005627 -0.2044583 0.0005725 -0.4252226 0.000722 0.2233595 -0.0025893 -0.0211883 0.0164745 -0.0478671 -0.0236879 -0.1277093 0.0427589 -0.0383563 0.0171412 -0.0025941 0.021202 0.0165858 0.0478584 -0.0237848 0.1276668 0.042863 0.0382723 0.0172793 0.0494765 -0.0964642 -0.0481544 -0.0844245 -0.0433026 -0.0239676 -0.040819 -0.0352415 0.1290998 0.0494805 0.0964898 -0.048088 0.0844394 -0.0433572 0.0238675 -0.0407553 0.0351282 0.1291338 0.0381966 0.0806062 -0.0372505 0.0917263 -0.0653189 0.0281006 -0.0458044 0.0274178 0.1444948 0.0381748 -0.0805886 -0.0373056 -0.0917048 -0.0652629 -0.0282345 -0.0458727 -0.027551 0.1444596 -0.0931231 0.0000373 -0.0873598 0.0000311 0.088587 -0.0000117 -0.0920214 -0.0000106 0.1293884 unknown
polarizability: 109.7229084|-0.0130581|85.0321313|5.1610443|0.016989|56.8538894 unknown
InChI: InChI=1S/C8H7N/c1-9-7-8-5-3-2-4-6-8/h2-6H,7H2
charge 0 multiplicity 1
16 atoms
N  2.530447 0.000275 -0.066875
C  0.115036 -0.000136 0.491977
C  1.555672 -0.000335 1.001334
C  -0.557547 1.222437 0.24881
C  -0.557655 -1.222506 0.248013
C  -1.885803 1.22403 -0.233442
C  -1.885903 -1.22365 -0.234237
C  -2.552659 0.0003 -0.476164
C  3.331507 -0.00068 -0.967376
H  1.740154 0.88955 1.632327
H  1.740086 -0.890759 1.631575
H  -0.042907 2.173748 0.432439
H  -0.043096 -2.173973 0.431041
H  -2.398069 2.174719 -0.418049
H  -2.398268 -2.174164 -0.419474
H  -3.582897 0.000445 -0.849299
