program: Gaussian 09
title: 000082515
version: EM64L-G09RevD.01
frameworkgroup: C1[X(C7H6O3S)]
method: RPBEPBE
basis: SDD
operation: Freq
keyword: #pfreq=noraman
keyword: PBEPBE/SDD
title: #p freq=noraman PBEPBE/SDD
converged: NO NO NO NO
title: Mulliken charges:
elementType: S O O O C C C C C C C H H H H H H
charge: 1.034549 -0.370827 -0.476515 -0.476398 -0.678220 0.252522 0.233218 -0.323233 -0.338855 -0.239256 -0.193461 0.300032 0.300280 0.239357 0.261637 0.237045 0.238124
chargesum: 0.00000
title: Mulliken charges with hydrogens summed into heavy atoms:
elementType: S O O O C C C C C C C
charge: 1.034549 -0.370827 -0.476515 -0.476398 -0.077908 0.252522 0.233218 -0.083876 -0.077218 -0.002212 0.044664
polarizability: 1.56137274e+02 -1.89589195e+00 9.93314625e+01 7.26291843e-02 -2.14495331e-03 6.74672025e+01
1716.lowfreq: -51.9703 -13.4073 -11.7650 -0.0010 0.0011 0.0013 6.1587 126.7043 181.5879
frequency: -51.8484 126.6585 181.5481 204.1652 218.2343 243.6715 249.5933 364.4951 416.1946 419.7262 509.1041 515.7741 522.3679 583.5078 621.5224 699.9772 749.1090 751.8057 839.7848 840.0598 853.3344 861.9421 935.6431 978.6175 986.4164 1028.6876 1096.0089 1097.8168 1140.2457 1172.2516 1191.3225 1230.7891 1282.1637 1369.8717 1406.7740 1429.8613 1459.5749 1577.1518 1603.8959 3038.0440 3129.0556 3137.7408 3148.4429 3170.3977 3186.1284
redmass: 5.8574 5.7422 3.6894 7.8764 8.5312 11.6218 4.2042 8.5476 2.9395 14.8584 9.0371 3.5923 8.9020 7.1706 6.6182 3.1922 5.1699 1.2778 1.4964 5.6467 18.3351 1.5232 1.3585 1.3137 6.0714 2.1533 1.2193 2.2324 1.3649 1.0729 2.0101 3.0366 1.4993 8.0831 1.1492 2.2470 2.6380 6.6930 6.7986 1.0547 1.1114 1.0871 1.0904 1.0964 1.0978
irintensity: 0.7852 1.2697 3.8686 2.6331 10.1783 1.3628 0.0311 42.9484 7.0495 57.6123 39.0182 0.3939 0.2879 6.6236 20.3898 1.2456 17.0054 96.1777 0.2470 21.4909 138.2597 4.9790 0.0993 0.0519 83.9242 5.8961 2.3701 16.6978 27.8032 0.9406 26.1877 38.7101 4.8724 21.3972 11.1926 49.7442 43.9945 19.0632 21.6173 6.2320 0.2183 1.0554 10.2332 16.1582 6.9739
temp: 298.150 k
press: 1.00000 atm
elementType: 16 8 8 8 6 6 6 6 6 6 6 1 1 1 1 1 1
symmnumber: 1
zpe: 302472.6 jmol-1
zpe.correction: 0.115206 hartree
zpe.thermalcorrener: 0.124160 hartree
zpe.thermalcorrenthalpy: 0.125104 hartree
zpe.thermalcorrgfe: 0.081148 hartree
zpe.sumelectzpe: -893.104107 hartree
zpe.sumelectthermal: -893.095153 hartree
zpe.sumelectthermalent: -893.094209 hartree
zpe.sumelectthermalfe: -893.138165 hartree
dipole: 4.7699 3.4362 -0.0126
dipole: 5.8787
quadrupole: -75.3357 -62.5161 -79.0783
quadrupole: -4.8751 0.0250 -0.0217
quadrupole: -3.0256 9.7939 -6.7683 -4.8751 0.0250 -0.0217
hfenergy: -893.2193127 hartree
pointgroup: C01 [X(C7H6O3S1)]
dipole: 1.8870705 1.337293 -0.0043228 debye
dipolederiv: 2.0238959 0.015594 -0.0006864 -0.3837605 0.9870194 0.0002733 -0.0014858 -0.0000471 1.2631121 -1.5601945 -0.034396 -0.0000217 -0.1555941 -0.407945 -0.0005457 -0.0037144 -0.0009884 -0.2781112 -0.6539129 -0.041519 -0.046572 -0.0008862 -0.3876072 0.0223469 -0.2237393 0.0011784 -0.5705269 -0.65361 -0.0417798 0.0463599 0.0002357 -0.3874071 -0.022123 0.2256638 -0.0006716 -0.5724884 0.0670267 -0.0681619 -0.0002762 0.1071228 -0.0124457 0.0000115 -0.0001848 0.0006996 0.0277921 -0.1581337 0.0556906 0.0004385 -0.4961562 -0.1666682 0.0002778 -0.0015566 0.0004751 -0.1032346 1.0701237 0.1819021 0.0006266 0.788676 0.0667629 -0.0006015 0.0016383 -0.0002697 0.0683567 0.1487408 -0.1108603 0.0004976 0.1423867 0.1495877 0.0001257 0.0019464 -0.0003622 -0.1205101 -0.3478119 -0.1145186 0.0000629 -0.0722208 0.11988 0.0003446 0.0026959 0.000107 -0.1605278 -0.0846849 0.1128088 0.0005224 0.0686478 -0.1696459 0.0004127 -0.000082 0.0002752 -0.1840862 0.1088788 0.031142 0.0004366 0.0163096 0.1364562 0.0000509 -0.0003809 0.0004357 -0.1251707 -0.0026735 -0.0009779 0.0187516 0.0035542 0.0438839 -0.0426521 0.0669661 -0.04242 0.0487173 -0.0051776 -0.0004504 -0.0191538 0.0012475 0.0448967 0.042597 -0.067035 0.0422237 0.04821 0.0922886 0.0304714 -0.0000992 -0.0184976 -0.0817304 -0.0001915 0.0001461 -0.0001435 0.1541862 0.1016541 -0.0305254 -0.0002035 0.0008947 -0.0297099 -0.0001176 0.0000889 -0.0001441 0.1732918 -0.0763461 -0.0783011 -0.0004461 -0.0766924 0.0495071 -0.0002642 -0.0004401 -0.000303 0.1720517 -0.0700633 0.0938817 -0.000237 0.0747326 0.0451656 0.0000552 -0.0005267 -0.0000453 0.1589381 unknown
polarizability: 156.1043848|-2.3372402|99.3643575|0.0607163|0.0178349|67.4671964 unknown
InChI: InChI=1S/C7H6O3S/c8-11(9)5-6-3-1-2-4-7(6)10-11/h1-4H,5H2
charge 0 multiplicity 1
17 atoms
S  -2.240408 0.02813 0.002074
O  -0.841591 -1.347406 -0.005547
O  -3.036724 -0.062685 -1.396659
O  -3.02338 -0.063065 1.408342
C  -0.88929 1.459827 -0.004266
C  0.426514 0.735181 -0.002176
C  0.391549 -0.688663 -0.003209
C  1.675248 1.397305 0.001075
C  1.586803 -1.44406 -0.001315
C  2.873136 0.650662 0.002461
C  2.821955 -0.764678 0.001137
H  -1.122561 2.029044 0.909329
H  -1.124167 2.020793 -0.922579
H  1.711201 2.492129 0.002237
H  1.531257 -2.535516 -0.001922
H  3.837324 1.167725 0.004704
H  3.749835 -1.346024 0.002313
