program: Gaussian 09
title: 000082517
version: EM64L-G09RevD.01
frameworkgroup: C1[X(C13H19NO2)]
method: RPBEPBE
basis: SDD
operation: Freq
keyword: #p
keyword: freq=noraman
keyword: PBEPBE/SDD
title: #p freq=noraman PBEPBE/SDD
converged: YES YES NO NO
title: Mulliken charges:
elementType: O O N C C C C C C C C C C C C C H H H H H H H H H H H H H H H H H H H
charge: -0.297314 -0.276120 -0.154070 0.460383 -0.398512 -0.398680 -0.360021 -0.353996 -0.660232 -0.660755 0.230448 -0.384358 -0.367475 0.169687 -0.216298 -0.677701 0.222130 0.228047 0.222549 0.227396 0.229242 0.227589 0.241818 0.216994 0.216300 0.241377 0.217568 0.215939 0.262899 0.263288 0.224380 0.224517 0.208258 0.227345 0.227377
chargesum: 0.00000
title: Mulliken charges with hydrogens summed into heavy atoms:
elementType: O O N C C C C C C C C C C C C C
charge: -0.297314 -0.276120 -0.154070 0.460383 0.051665 0.051265 -0.130779 -0.126408 0.014880 0.014129 0.230448 -0.121459 -0.104187 0.169687 0.232600 -0.014721
polarizability: 2.71748928e+02 -7.67327176e+00 1.54768164e+02 -1.57726245e+00 7.76306089e+00 9.53330654e+01
1716.lowfreq: -6.5142 -3.8757 0.0004 0.0006 0.0007 7.8129 33.7270 52.1953 59.6552
frequency: 33.4827 52.1769 59.5314 69.9047 78.2547 98.8051 102.2590 113.3323 142.0167 191.9328 210.6614 225.2075 247.0464 256.1275 276.6743 309.6230 324.7479 353.8691 403.9665 420.5640 448.5578 483.0341 508.3510 543.6423 574.8900 630.9105 678.1701 710.4805 753.5819 783.8698 786.2771 797.2627 800.3836 813.5816 832.1855 851.8909 891.6987 923.8437 971.8658 981.9676 991.3767 1013.7966 1025.5787 1060.6623 1073.6833 1077.9348 1094.9602 1111.5499 1130.4051 1136.7422 1161.4898 1191.7570 1202.6677 1247.8949 1262.2483 1268.8637 1288.0066 1314.3161 1340.7351 1350.2870 1360.1026 1373.4945 1387.7447 1390.2567 1399.7159 1402.5429 1446.5785 1463.9968 1467.0920 1468.5478 1474.9347 1477.4115 1482.6711 1488.1494 1493.3109 1505.4539 1526.1569 1552.8638 1608.7196 1629.6854 2983.7067 2984.2639 2991.3112 2992.8501 2996.9808 3003.8571 3040.1399 3045.5837 3060.3280 3080.2716 3080.4059 3089.1347 3091.8193 3093.7049 3103.5038 3144.0583 3151.8503 3167.5279 3174.9651
redmass: 3.5947 3.5659 2.6653 3.5830 3.4871 2.9220 2.9614 3.4391 3.1109 1.6687 1.0434 1.8695 1.3212 4.1379 2.7673 3.9121 2.9672 3.6428 3.6523 3.0116 2.7000 3.6806 3.0431 3.0611 3.8411 7.0709 4.0444 4.7896 4.5237 1.8984 1.1345 2.0277 1.1053 1.2683 1.8104 3.8838 2.3007 2.1547 1.3491 1.3456 3.3854 3.1116 2.3045 5.1734 2.1618 1.8194 1.6722 2.1990 1.4855 1.4638 1.9336 1.2015 2.3466 1.1351 2.6354 1.3820 1.2140 1.3466 1.2786 1.3418 1.4215 4.1766 1.2135 1.2543 1.3037 1.9742 3.9784 1.0406 1.0472 1.0436 1.0564 1.0635 1.0481 1.0739 1.0883 1.2748 2.3269 7.0993 10.7222 6.3752 1.0357 1.0357 1.0604 1.0358 1.0609 1.0581 1.1028 1.1023 1.1065 1.0998 1.0995 1.0985 1.1012 1.1009 1.1022 1.0878 1.0868 1.0947 1.0962
irintensity: 1.4641 0.0955 0.1475 0.6675 0.8545 0.2305 2.0318 0.3563 4.0209 1.1123 0.6643 1.9504 0.3201 1.7510 2.1480 4.9075 0.2634 9.0341 7.0706 0.3993 2.2990 5.2860 9.2418 0.2393 9.6158 1.6145 26.3944 1.0372 14.6185 32.3203 3.7126 3.2082 1.4453 1.9185 59.0561 8.3747 0.0022 4.2063 1.9448 1.8647 26.9779 47.5423 28.0813 454.0752 12.4788 13.1139 18.1157 1.5685 0.7359 5.1580 45.8606 281.2840 41.3737 0.0498 408.2024 14.9002 3.4921 6.7657 16.7751 87.2979 5.3908 8.9404 2.0079 37.9746 34.0759 87.0915 8.9347 11.4501 7.6882 10.9761 6.4565 0.0802 0.0116 16.1621 31.2043 29.6259 169.2016 12.3850 410.3093 342.4830 29.2556 27.2736 51.9978 26.6261 51.1196 29.4825 5.6816 12.2519 11.4030 7.5006 81.3539 39.2797 15.5443 68.6088 48.4748 2.0474 9.7754 23.2798 9.6615
temp: 298.150 k
press: 1.00000 atm
elementType: 8 8 7 6 6 6 6 6 6 6 6 6 6 6 6 6 1 1 1 1 1 1 1 1 1 1 1 1 1 1 1 1 1 1 1
symmnumber: 1
zpe: 776120.9 jmol-1
zpe.correction: 0.295609 hartree
zpe.thermalcorrener: 0.312977 hartree
zpe.thermalcorrenthalpy: 0.313921 hartree
zpe.thermalcorrgfe: 0.249504 hartree
zpe.sumelectzpe: -710.764712 hartree
zpe.sumelectthermal: -710.747344 hartree
zpe.sumelectthermalent: -710.746399 hartree
zpe.sumelectthermalfe: -710.810817 hartree
dipole: -4.4638 2.5343 0.5330
dipole: 5.1606
quadrupole: -74.5117 -96.3167 -99.2603
quadrupole: 8.0447 1.9061 0.8001
quadrupole: 15.5178 -6.2871 -9.2307 8.0447 1.9061 0.8001
hfenergy: -711.0603205 hartree
pointgroup: C01[X(C13H19N1O2)]
dipole: 1.780323 -0.6967502 -0.6835812 debye
polarizability: 272.0470752|-2.5321192|121.4391656|-4.5398175|30.3636411|128.3639167 unknown
InChI: InChI=1S/C13H19NO2/c1-4-14(5-2)12-9-7-11(8-10-12)13(15)16-6-3/h7-10H,4-6H2,1-3H3
charge 0 multiplicity 1
35 atoms
O  -3.440018 -0.476891 -0.16894
O  -3.231598 1.219841 1.42195
N  3.001352 -0.178005 -0.003398
C  1.618813 -0.046655 0.142607
C  3.944909 0.727577 0.684423
C  3.595833 -1.230012 -0.853713
C  1.050129 0.908173 1.053214
C  0.706181 -0.861062 -0.610546
C  4.306056 0.271692 2.117866
C  3.728389 -0.822372 -2.34026
C  -1.231693 0.221268 0.445189
C  -0.337698 1.035097 1.191826
C  -0.680586 -0.728887 -0.455983
C  -2.685474 0.396985 0.637794
C  -4.918028 -0.362003 -0.030766
C  -5.530333 -1.383619 -0.985013
H  4.86521 0.782435 0.072721
H  3.527952 1.751273 0.70145
H  4.597139 -1.46592 -0.446636
H  3.002103 -2.158005 -0.762085
H  1.697134 1.542145 1.665504
H  1.083606 -1.590994 -1.331805
H  3.406899 0.216344 2.755634
H  4.773493 -0.729555 2.105263
H  5.019472 0.978311 2.581235
H  2.742354 -0.587408 -2.776886
H  4.36704 0.073186 -2.44619
H  4.184283 -1.640959 -2.927728
H  -0.761036 1.76443 1.891073
H  -1.358834 -1.357365 -1.040584
H  -5.189725 -0.553286 1.023699
H  -5.215821 0.674576 -0.273871
H  -6.63335 -1.342275 -0.922476
H  -5.233166 -1.175657 -2.027379
H  -5.205586 -2.406502 -0.727489
