program: Gaussian 09
title: 000082452
version: EM64L-G09RevD.01
frameworkgroup: C1[X(C9H12O2)]
method: RPBEPBE
basis: SDD
operation: Freq
keyword: #pfreq=noraman
keyword: PBEPBE/SDD
title: #p freq=noraman PBEPBE/SDD
converged: YES YES NO NO
title: Mulliken charges:
elementType: O O C C C C C C C C C H H H H H H H H H H H H
charge: -0.436440 -0.435882 -0.558337 -0.399302 0.514877 -0.313441 -0.383501 -0.388942 -0.384732 -0.345514 0.278013 0.203681 0.206766 0.230961 0.201515 0.215283 0.182131 0.232351 0.232286 0.217119 0.248700 0.330193 0.352216
chargesum: 0.00000
title: Mulliken charges with hydrogens summed into heavy atoms:
elementType: O O C C C C C C C C C
charge: -0.106248 -0.083667 -0.147890 0.033174 0.514877 0.083972 -0.151150 -0.156655 -0.167613 -0.096814 0.278013
polarizability: 1.41484895e+02 -1.79710018e+00 1.00404066e+02 -1.30646305e+01 -8.96952222e-01 6.64247778e+01
1716.lowfreq: -9.7659 -5.6912 -0.0008 -0.0007 -0.0006 15.2978 29.8610 57.3562 70.7248
frequency: 28.3469 57.3419 70.7180 116.6819 162.3163 239.5887 297.2588 313.3460 334.8342 348.4474 402.6247 410.4885 439.9673 491.0606 541.7347 636.5172 718.4785 753.9597 764.5326 806.6922 823.8225 836.5125 856.4319 929.9860 957.7693 961.8571 1003.2258 1022.3945 1043.6900 1056.6330 1100.0225 1127.3447 1145.0642 1178.9836 1217.2902 1243.6109 1247.0891 1262.8739 1284.7688 1318.2254 1321.9560 1349.2691 1380.5155 1391.2873 1425.9099 1466.1923 1474.3831 1487.6322 1504.2426 1597.9732 1627.7357 2943.0859 2971.3794 2980.0708 3023.4349 3046.9437 3072.4571 3108.2687 3122.1701 3134.5931 3168.5665 3559.2548 3583.8517
redmass: 3.6041 6.2984 1.8369 2.7045 5.1960 4.4321 2.4031 1.4286 3.1020 1.1358 3.1767 2.9524 4.0059 4.9746 2.6512 6.7417 3.7372 4.4153 1.0978 1.4131 3.1496 1.8716 1.2530 1.3752 1.5520 3.2140 2.8358 3.7227 1.7638 2.6226 1.3616 1.1702 1.3642 1.1105 2.2137 1.3701 2.9085 1.2923 1.0885 1.3239 1.2810 1.3659 1.2504 6.0464 2.7970 1.0773 1.0938 1.0971 2.7835 6.4320 6.4860 1.0694 1.0616 1.0613 1.0981 1.0975 1.0993 1.0874 1.0898 1.0963 1.0951 1.0661 1.0660
irintensity: 2.4751 0.1125 6.1767 3.2083 1.8933 1.6855 7.5981 115.1069 56.9695 149.0173 8.2276 1.2909 10.7055 14.4702 25.9595 0.5800 1.2662 9.9692 4.6981 31.2869 11.4000 46.4510 4.7057 1.2081 15.0678 73.8741 3.4992 4.2666 1.1203 38.4988 15.5464 71.1304 189.5215 3.2029 2.2503 29.9344 20.4229 1.2826 0.8612 2.8476 14.8973 5.2312 27.0657 12.3421 13.5089 0.6084 0.5519 11.6614 101.6190 8.1558 24.9170 67.3686 3.6791 69.5099 6.2713 19.4175 57.9364 18.5286 20.4390 15.5933 6.6661 7.9575 36.4607
temp: 298.150 k
press: 1.00000 atm
elementType: 8 8 6 6 6 6 6 6 6 6 6 1 1 1 1 1 1 1 1 1 1 1 1
symmnumber: 1
zpe: 498207.0 jmol-1
zpe.correction: 0.189757 hartree
zpe.thermalcorrener: 0.200990 hartree
zpe.thermalcorrenthalpy: 0.201935 hartree
zpe.thermalcorrgfe: 0.151483 hartree
zpe.sumelectzpe: -499.753246 hartree
zpe.sumelectthermal: -499.742013 hartree
zpe.sumelectthermalent: -499.741068 hartree
zpe.sumelectthermalfe: -499.791520 hartree
dipole: 1.1668 -0.2780 0.3740
dipole: 1.2564
quadrupole: -77.4299 -58.2488 -67.6621
quadrupole: -14.5316 -4.2209 -1.1845
quadrupole: -9.6497 9.5315 0.1182 -14.5316 -4.2209 -1.1845
hfenergy: -499.943003 hartree
pointgroup: C01 [X(C9H12O2)]
dipole: 0.4582561 0.1163134 -0.144267 debye
dipolederiv: -0.905508 -0.1735608 0.1694225 -0.202057 -0.2425696 -0.1102737 0.2802672 -0.1248681 -0.6123813 -1.4670507 -0.0399941 -0.2769061 -0.0213162 -0.0624069 0.0014568 -0.3219262 -0.0044341 -0.5141075 -0.070081 -0.0033508 0.0320891 0.0001279 0.1631408 0.0048823 0.1249981 0.0062307 0.1522066 -0.2400424 -0.0250742 0.0350358 -0.0047701 0.1363085 -0.0417719 -0.1435898 -0.0175507 0.0002042 0.277469 -0.0044628 0.0471039 0.0264145 -0.1967297 0.0049689 0.0710093 -0.0050263 -0.099513 0.6211967 0.0500266 -0.1671606 0.0800096 0.3248763 0.0307285 -0.0904978 0.0459272 0.53852 -0.003797 0.0925284 0.0641373 -0.0798302 0.1272913 -0.0171908 0.0459176 0.0395968 -0.1213225 0.018235 -0.0741259 0.0727323 0.056665 0.139697 0.0237549 0.0599655 -0.0200907 -0.1294918 -0.3074975 -0.048992 -0.0226061 0.2732717 0.0221478 0.074755 -0.0288883 -0.0128863 -0.2040039 -0.2683285 0.0245628 -0.0208791 -0.271773 0.0371078 -0.0679437 -0.0381953 0.0136754 -0.1722894 1.3349091 0.0620299 0.3658156 0.0566548 0.0371792 0.0181207 0.3980494 0.0178114 0.1806003 0.0160048 -0.021675 -0.0344408 -0.0613498 -0.0769623 -0.138446 -0.0320264 -0.0747984 -0.0150378 0.01154 0.0231595 -0.0360563 0.0609789 -0.0662723 0.1373801 -0.0332703 0.0745616 -0.0177242 0.0503739 -0.0467937 -0.0204704 -0.0344406 -0.0561617 -0.1084872 -0.0439391 -0.0809148 -0.0075466 0.0418848 0.040815 -0.009125 0.0139742 -0.0765341 0.1391123 -0.0305032 0.0922829 -0.0306761 0.0356175 0.0254877 -0.0015634 0.0519971 -0.0621312 0.124013 -0.0161895 0.0834835 -0.024449 -0.020217 -0.0204046 0.0252605 -0.0517829 -0.1162094 -0.1758318 -0.0065809 -0.1193548 -0.1030333 0.0384702 0.100501 -0.0401354 0.0950602 -0.0497714 0.0217771 -0.0363519 0.0258304 0.1275967 0.0438436 -0.1028839 -0.0422789 -0.0915949 -0.0561509 -0.0285316 -0.037748 -0.0348033 0.1250275 -0.0117061 -0.106646 -0.0531871 -0.1013348 -0.0518412 -0.0304119 -0.0606223 -0.0343004 0.1549128 0.0451836 0.0762686 -0.0333333 0.0808184 -0.0186941 0.0176269 -0.0391324 0.0176438 0.16052 0.3558235 0.1537857 -0.0537824 0.1490656 0.0993161 0.1370434 -0.0259198 0.1133242 0.2283089 0.4036761 0.0187987 0.0003279 -0.0247886 0.0453701 -0.0167315 0.0051739 -0.0013398 0.3836793 unknown
polarizability: 141.3931594|1.9723801|100.4591593|13.2590006|-0.1859237|66.4614206 unknown
InChI: InChI=1S/C9H12O2/c10-7-1-2-8-3-5-9(11)6-4-8/h3-6,10-11H,1-2,7H2
charge 0 multiplicity 1
23 atoms
O  -4.782124 0.025708 0.996965
O  4.096345 -0.045641 0.695879
C  -1.433068 -0.009114 -0.972104
C  -2.386724 0.00063 0.256379
C  0.034504 0.003406 -0.570277
C  -3.869019 -0.025781 -0.156907
C  0.717971 1.222815 -0.336779
C  0.750163 -1.207379 -0.37218
C  2.066002 1.242049 0.0845
C  2.09526 -1.209918 0.048368
C  2.752842 0.019815 0.278956
H  -1.65048 -0.905677 -1.586199
H  -1.663756 0.871646 -1.603504
H  -2.197813 0.901377 0.870538
H  -2.159402 -0.876515 0.897582
H  -4.125563 0.872537 -0.744654
H  -4.076223 -0.92076 -0.784936
H  0.19277 2.173831 -0.488719
H  0.248116 -2.165631 -0.555037
H  2.576011 2.199504 0.25528
H  2.648224 -2.142175 0.197174
H  -4.58631 -0.743006 1.590527
H  4.466374 0.861877 0.830347
