program: Gaussian 09
title: 000082449
version: EM64L-G09RevD.01
frameworkgroup: C1[X(C7H7N3O4)]
method: RPBEPBE
basis: SDD
operation: Freq
keyword: #pfreq=noraman
keyword: PBEPBE/SDD
title: #p freq=noraman PBEPBE/SDD
converged: YES YES NO NO
title: Mulliken charges:
elementType: O O O O N N N C C C C C C C H H H H H H H
charge: -0.178121 -0.256717 -0.211147 -0.198315 0.015340 0.002865 -0.649244 0.278561 0.130957 0.268938 0.346107 -0.382646 -0.398380 -0.748014 0.288549 0.242531 0.232188 0.276886 0.242185 0.373729 0.323749
chargesum: 0.00000
title: Mulliken charges with hydrogens summed into heavy atoms:
elementType: O O O O N N N C C C C C C C
charge: -0.178121 -0.256717 -0.211147 -0.198315 0.015340 0.002865 0.048233 0.278561 0.130957 0.268938 0.346107 -0.094096 -0.155849 0.003245
polarizability: 1.83850786e+02 -6.07058316e+00 1.46803610e+02 -1.57026032e+00 3.68488626e+00 5.27043955e+01
1716.lowfreq: -8.4032 -3.5448 -0.0010 -0.0009 -0.0008 5.1535 50.4827 66.8684 103.2928
frequency: 50.4643 66.8648 103.2917 110.0913 202.1286 217.5747 236.1423 272.0443 312.4783 332.9223 370.2364 396.5887 409.4779 457.7055 470.5577 521.2178 545.9869 567.9574 596.1515 643.6104 651.9399 706.0945 721.7951 727.8903 739.7889 763.2200 825.9979 840.4833 969.9247 985.7545 1030.2553 1032.8718 1087.0899 1106.8455 1166.9969 1181.2660 1204.5868 1212.3402 1328.2417 1345.4830 1352.3132 1389.9975 1399.2160 1421.3565 1458.1738 1476.5618 1497.4406 1561.1626 1581.2209 1627.0904 3019.0754 3103.7187 3131.1741 3148.7046 3187.7434 3413.4138 3636.1982
redmass: 11.3249 9.3761 7.0448 4.8927 3.0953 1.6755 3.7120 6.9657 6.4116 8.1857 5.9374 4.9407 2.7267 6.7760 3.6228 1.2125 4.9441 3.7466 4.5176 6.4183 6.8160 5.9860 2.2591 6.1710 2.0507 9.9530 1.5252 5.7079 1.5766 2.0037 1.5726 1.5351 2.6601 4.8266 2.6283 2.7272 2.1030 6.0962 7.0510 3.4675 5.7669 2.7004 1.3306 2.6774 1.2708 1.1311 3.9206 6.9394 1.3821 5.2561 1.0383 1.0949 1.1011 1.0904 1.0955 1.0539 1.0962
irintensity: 1.8313 3.5654 0.7302 1.8504 3.1359 3.7979 3.5957 4.0816 0.8418 1.4745 3.9843 4.3928 2.4270 1.7083 3.0203 95.3494 6.6395 1.0306 14.2086 20.8685 11.1484 34.0194 42.1763 14.7260 103.0928 6.6747 39.2469 6.2707 3.2351 0.2125 20.1124 4.1443 17.7055 1.3591 201.4511 238.6685 18.8114 295.3091 171.7313 7.2326 29.0292 41.4715 82.8231 21.3063 1.7701 18.1719 58.9519 68.2620 82.8705 376.4342 1.9071 7.3392 6.6316 6.1656 3.6245 129.9579 71.1822
temp: 298.150 k
press: 1.00000 atm
elementType: 8 8 8 8 7 7 7 6 6 6 6 6 6 6 1 1 1 1 1 1 1
symmnumber: 1
zpe: 382308.1 jmol-1
zpe.correction: 0.145613 hartree
zpe.thermalcorrener: 0.157817 hartree
zpe.thermalcorrenthalpy: 0.158761 hartree
zpe.thermalcorrgfe: 0.106920 hartree
zpe.sumelectzpe: -734.916060 hartree
zpe.sumelectthermal: -734.903857 hartree
zpe.sumelectthermalent: -734.902913 hartree
zpe.sumelectthermalfe: -734.954754 hartree
dipole: -3.2130 5.1693 0.2006
dipole: 6.0898
quadrupole: -101.5710 -70.5336 -81.2923
quadrupole: -11.2719 0.0611 -4.3149
quadrupole: -17.1054 13.9320 3.1733 -11.2719 0.0611 -4.3149
hfenergy: -735.0616735 hartree
pointgroup: C01 [X(C7H7N3O4)]
dipole: 1.2400307 2.0395433 -0.2073452 debye
dipolederiv: -0.4035246 0.057831 0.0190392 0.1851912 -0.8490276 0.2144338 0.003702 0.2619353 -0.2963187 -0.9544941 0.0298804 0.1586569 -0.100856 -0.3619103 0.1086012 0.1233342 0.1140173 -0.3485964 -0.9490459 0.1685683 -0.1096493 0.2772094 -0.4708536 0.1395457 -0.1016114 0.1252402 -0.2957433 -0.6162072 -0.1652704 0.0398392 -0.349136 -0.7068777 0.1846448 0.0530122 0.1831211 -0.2847989 1.4592639 -0.4651604 -0.2050241 -0.4694604 1.1388806 -0.3908935 -0.1568213 -0.4070531 0.3813324 2.0054192 0.1461741 0.0896835 0.2963569 0.914469 -0.393296 0.0598084 -0.3709752 0.3181243 -1.2235393 -0.6347931 -0.0126309 -0.4428225 -0.5137699 0.0679134 -0.0186203 -0.0073027 -0.5894478 0.8282971 -0.2168102 0.0004714 -0.0275601 0.3574256 0.0696897 0.0089779 0.1333516 0.061475 -0.7886121 0.3473729 0.0299365 -0.0969772 -0.5839301 0.0476758 0.0208704 0.0079702 -0.0640465 -1.01375 0.0521706 -0.0052603 -0.0695683 -0.5163804 0.0420295 -0.0072583 0.0233155 -0.0234144 1.1781813 0.7011069 -0.0448117 0.2503606 0.5108483 -0.0169381 0.0338757 -0.0848495 0.1818341 0.2479077 0.2506725 -0.0004311 0.2978576 0.4219862 0.0096191 -0.1138161 -0.0062878 -0.0482596 -0.6277005 -0.3437216 -0.0001394 0.1639667 0.1467689 -0.0089232 0.0193111 0.0253599 -0.2041748 0.0979431 -0.0498328 -0.0005131 -0.0523385 -0.2614173 -0.0027864 0.0000813 0.0211078 0.0641635 0.0803116 0.0693839 0.0075746 0.0098711 0.0998055 -0.0130352 0.0136042 0.0040084 0.157784 0.047918 -0.0709069 0.0033764 -0.0251773 -0.0679852 -0.001603 0.0284426 0.0023222 0.1669217 -0.0122744 0.0733682 0.0897621 0.0186416 0.0783434 -0.0257213 0.063964 -0.0434259 0.0432817 0.0995045 0.0051668 0.0018243 0.0007135 0.0795936 0.028328 0.0035337 0.0275037 -0.0035298 -0.0344128 -0.0426156 -0.0877913 0.0261512 0.0993445 0.0004271 -0.0588921 -0.0212186 0.0525442 0.3395624 0.0045327 0.0138812 0.0047616 0.2849255 -0.0433491 0.0371253 0.0049508 0.3693103 0.2392521 0.0828828 0.012206 0.102815 0.199761 -0.0163624 -0.0126236 0.0069088 0.361559 unknown
polarizability: 183.6854914|6.3342732|146.1703143|-2.6021996|-9.3133769|53.5029857 unknown
InChI: InChI=1S/C7H7N3O4/c1-4-6(9(11)12)3-2-5(8)7(4)10(13)14/h2-3H,8H2,1H3
charge 0 multiplicity 1
21 atoms
O  2.1101 -2.128083 0.662283
O  3.394963 -0.530695 -0.309196
O  -3.634873 0.671654 -0.318124
O  -3.028099 -1.352271 0.536373
N  2.234452 -0.966401 0.118734
N  -2.738771 -0.176721 0.081202
N  2.542696 1.912584 -0.062564
C  -0.247449 -0.658166 -0.012694
C  1.067667 -0.082535 0.012173
C  -1.328908 0.260673 0.047736
C  1.296485 1.34785 -0.00878
C  -1.132393 1.669959 0.083845
C  0.147998 2.201836 0.054748
C  -0.470996 -2.145466 -0.214971
H  -2.013395 2.315626 0.116489
H  0.296712 3.286555 0.068939
H  0.360855 -2.60394 -0.769464
H  -0.544698 -2.671136 0.75227
H  -1.415265 -2.324538 -0.749014
H  3.350031 1.298867 -0.220759
H  2.645488 2.923749 -0.003728
