program: Gaussian 09
title: 000082447
version: EM64L-G09RevD.01
frameworkgroup: C1[X(C9H18N2O)]
method: RPBEPBE
basis: SDD
operation: Freq
keyword: #p
keyword: freq=noraman
keyword: PBEPBE/SDD
title: #p freq=noraman PBEPBE/SDD
converged: YES YES NO NO
title: Mulliken charges:
elementType: O N N C C C C C C C C C H H H H H H H H H H H H H H H H H H
charge: -0.288476 -0.120013 -0.375889 -0.326901 -0.332614 -0.342082 -0.669352 -0.666447 0.132628 0.372886 -0.821347 -0.654061 0.206900 0.195670 0.230563 0.194994 0.253480 0.221502 0.210727 0.225245 0.210423 0.206811 0.219376 0.212481 0.321458 0.240991 0.228693 0.229274 0.221576 0.261503
chargesum: 0.00000
title: Mulliken charges with hydrogens summed into heavy atoms:
elementType: O N N C C C C C C C C C
charge: -0.288476 -0.120013 -0.054432 0.075670 0.092943 0.132900 -0.022956 -0.027779 0.132628 0.372886 -0.122389 -0.170982
polarizability: 1.55592503e+02 8.35238674e+00 9.54852753e+01 -8.32746402e+00 1.61710702e+00 1.05422014e+02
1716.lowfreq: -17.0131 -10.9473 0.0007 0.0008 0.0009 6.5621 14.3417 33.7547 51.0982
frequency: 12.7986 33.3291 51.0445 63.1643 69.3335 92.7402 169.3116 180.3722 192.0062 215.8405 234.0480 278.2899 283.9461 333.1622 355.8860 384.9841 399.2001 435.7531 476.1519 528.1785 568.3464 606.4020 647.3741 734.6209 788.6531 791.5408 794.1324 840.7320 910.2304 944.0156 986.0054 989.1095 998.3747 1033.1287 1047.8279 1057.0201 1074.2149 1077.0522 1085.3374 1120.4968 1180.2668 1187.7554 1212.0814 1257.2321 1279.8721 1292.2174 1296.6341 1363.9195 1371.0727 1380.7959 1384.9203 1387.5778 1388.5078 1408.7707 1460.7557 1464.2175 1467.1973 1470.4815 1474.7771 1478.8088 1484.8923 1485.3263 1491.7907 1496.0617 1577.4468 1660.9435 2873.4042 2882.6298 2947.4666 2963.4307 2982.3842 2983.0222 3021.9991 3032.4280 3037.9267 3043.2804 3075.1682 3077.2216 3088.1260 3089.5032 3091.5406 3100.3852 3214.0158 3551.7141
redmass: 3.3514 3.3198 2.8843 4.4131 2.1156 2.0758 3.4923 1.4290 1.4183 1.0565 2.1091 2.0634 2.0453 2.7541 3.1118 3.2134 3.1901 2.8327 2.7543 2.6029 3.3993 1.3532 1.5104 2.9754 1.9799 1.1555 1.2012 3.4756 2.0227 1.9120 1.3197 2.1215 1.4208 2.1041 1.5106 2.2730 2.4692 2.6297 2.1266 1.8403 2.0879 2.0557 2.2775 1.3566 1.5726 1.2994 1.5670 1.3303 1.3234 1.3561 1.2279 1.2232 1.1843 1.2367 1.1956 1.0546 1.2643 1.1148 1.0458 1.0537 1.1232 1.0756 1.0776 1.1555 7.4869 5.4699 1.0723 1.0712 1.0638 1.0384 1.0358 1.0357 1.0963 1.0897 1.0979 1.0882 1.0984 1.0978 1.0967 1.1003 1.1004 1.0616 1.1154 1.0768
irintensity: 2.4295 1.2526 1.4371 6.6730 0.7653 1.3871 0.9377 0.8343 0.6206 1.3750 4.7123 2.6761 2.2108 1.7706 7.5151 1.3387 0.2421 4.6386 6.6414 35.9646 0.2548 90.8338 0.7318 8.0833 6.9837 10.1942 10.1537 1.4533 1.0021 6.6204 59.3367 13.9765 8.8933 18.4610 4.3979 28.0474 59.2478 5.2585 3.8669 11.8427 63.8580 77.7477 8.4005 33.9710 38.7293 38.3134 1.4531 11.0982 15.6812 0.0455 25.5533 12.7546 34.7215 9.7517 97.1396 16.2224 161.0361 35.7565 15.1988 4.1789 34.0230 3.9947 10.6008 45.4310 141.4373 1.8733 40.4905 144.4425 34.2421 23.1178 31.6444 26.3995 26.4188 11.7291 22.9161 10.3232 31.9236 87.7083 28.9056 38.8409 41.8017 9.4840 5.2437 20.3580
temp: 298.150 k
press: 1.00000 atm
elementType: 8 7 7 6 6 6 6 6 6 6 6 6 1 1 1 1 1 1 1 1 1 1 1 1 1 1 1 1 1 1
symmnumber: 1
zpe: 683929.7 jmol-1
zpe.correction: 0.260495 hartree
zpe.thermalcorrener: 0.275604 hartree
zpe.thermalcorrenthalpy: 0.276549 hartree
zpe.thermalcorrgfe: 0.216070 hartree
zpe.sumelectzpe: -537.485641 hartree
zpe.sumelectthermal: -537.470532 hartree
zpe.sumelectthermalent: -537.469588 hartree
zpe.sumelectthermalfe: -537.530067 hartree
dipole: -1.8895 0.6734 3.1246
dipole: 3.7131
quadrupole: -69.3382 -74.8835 -78.7739
quadrupole: 3.5577 9.4775 -1.7656
quadrupole: 4.9937 -0.5516 -4.4420 3.5577 9.4775 -1.7656
hfenergy: -537.7461365 hartree
pointgroup: C01 [X(C9H18N2O1)]
dipole: 0.7698215 -0.5393033 1.1182788 debye
polarizability: 154.5051122|9.3700269|97.9751816|10.8613445|-3.2526564|104.0194989 unknown
InChI: InChI=1S/C9H18N2O/c1-5-11(6-2)7-10-9(12)8(3)4/h10H,3,5-7H2,1-2,4H3
charge 0 multiplicity 1
30 atoms
O  -1.866664 0.839119 -1.618515
N  1.855555 0.045527 -0.142399
N  -0.507581 0.364415 0.208883
C  3.156856 0.757904 -0.023737
C  1.872536 -1.095986 -1.100037
C  0.710522 0.952328 -0.364847
C  3.343183 1.448756 1.341434
C  2.590981 -2.337645 -0.539111
C  -1.719541 0.315661 -0.466121
C  -2.844857 -0.397929 0.260259
C  -2.596012 -1.014368 1.627154
C  -4.052008 -0.45322 -0.362725
H  3.956738 0.006714 -0.148824
H  3.295411 1.501553 -0.847353
H  0.82016 -1.358603 -1.313976
H  2.330808 -0.798695 -2.07534
H  0.48538 1.153753 -1.434812
H  0.934328 1.919793 0.12241
H  2.57521 2.222698 1.52336
H  3.278533 0.706307 2.155829
H  4.331124 1.943445 1.390844
H  3.658054 -2.140468 -0.329046
H  2.113758 -2.660592 0.402729
H  2.542208 -3.17023 -1.26513
H  -0.392409 -0.087482 1.117661
H  -3.51146 -1.496042 2.008995
H  -1.80537 -1.789919 1.590461
H  -2.288606 -0.253438 2.371374
H  -4.915412 -0.950768 0.092444
H  -4.174425 0.010412 -1.347565
