program: Gaussian 09
title: 000082456
version: EM64L-G09RevD.01
frameworkgroup: C1[X(C13H12N2O2S)]
method: RPBEPBE
basis: SDD
operation: Freq
keyword: #p
keyword: freq=noraman
keyword: PBEPBE/SDD
title: #p freq=noraman PBEPBE/SDD
converged: YES YES NO NO
title: Mulliken charges:
elementType: S O O N N C C C C C C C C C C C C C H H H H H H H H H H H H
charge: 0.776089 -0.539200 -0.559875 -0.700020 -0.700020 -0.695413 -0.166817 -0.166817 0.553867 0.553867 -0.495480 -0.495480 -0.409003 -0.409003 0.536385 0.536385 -0.431522 -0.431522 0.277859 0.227446 0.283824 0.283824 0.236289 0.236289 0.221452 0.221451 0.309720 0.317852 0.309720 0.317852
chargesum: 0.00000
title: Mulliken charges with hydrogens summed into heavy atoms:
elementType: S O O N N C C C C C C C C C C C C C
charge: 0.776089 -0.539200 -0.559875 -0.072449 -0.072449 -0.190107 -0.166817 -0.166817 0.553867 0.553867 -0.211656 -0.211656 -0.172713 -0.172714 0.536385 0.536385 -0.210070 -0.210070
polarizability: 2.57159175e+02 -6.10922392e-06 1.84333745e+02 -9.23260174e-05 1.54869806e+01 1.23137499e+02
1716.lowfreq: -9.2529 -5.2993 -0.0010 -0.0005 0.0009 4.9501 36.9632 94.6946 105.5795
frequency: 36.9587 94.6933 105.5770 115.6695 125.2755 168.4307 194.7135 218.3062 244.7786 288.0655 296.8674 305.0220 308.9966 342.5602 368.7335 370.0044 386.3039 390.7490 393.5564 410.7496 435.7808 439.8150 460.6341 463.9360 498.2213 542.2279 585.9836 605.4484 669.6819 675.4684 695.0775 703.1805 779.6415 782.8929 790.2079 819.0073 825.2170 871.2064 873.9503 875.2495 877.8957 905.9930 917.0556 943.4507 954.3975 1000.3222 1008.2602 1029.9342 1035.9360 1128.7984 1152.6101 1172.8456 1203.6184 1209.5159 1252.6651 1257.7415 1299.3934 1320.0423 1323.2080 1377.4483 1387.9719 1434.9251 1439.2926 1450.1224 1502.1773 1511.7049 1562.4112 1567.8369 1634.4423 1639.0747 1646.3400 1650.0061 2963.5561 3059.2660 3120.4116 3120.5800 3136.1493 3136.7749 3143.5863 3143.9971 3567.2434 3567.5696 3707.2065 3707.2226
redmass: 5.6764 4.1666 6.4762 7.9699 4.4195 8.1312 4.1248 6.1070 5.9343 4.9044 6.0692 4.6631 3.2665 3.6019 1.0906 1.0948 4.6332 1.2288 1.2323 4.0221 3.0254 3.7538 3.6101 5.3370 6.6507 6.0480 4.3708 3.8776 7.0242 7.4484 3.0393 3.0292 3.2601 4.2016 13.2563 1.4303 1.7433 3.8279 5.9725 1.5632 1.8138 3.0239 3.3920 1.3689 1.5393 2.7653 2.9092 1.4802 1.4418 1.3711 1.2396 1.1174 2.4433 1.8008 1.2368 1.5503 2.5334 2.5689 1.9320 4.5359 3.8360 3.7128 3.8769 1.1302 3.9002 3.6921 6.5863 7.2469 2.9855 1.8413 1.4907 2.2006 1.0662 1.0941 1.0871 1.0871 1.0918 1.0921 1.0966 1.0966 1.0450 1.0452 1.1041 1.1041
irintensity: 4.4753 0.7604 1.4209 0.0219 0.3161 12.4987 10.8453 7.9163 4.1297 0.0005 4.4087 0.1781 2.1158 2.1544 13.0464 61.4692 31.9294 87.8429 446.2653 21.3798 0.6696 1.3832 24.9006 41.4083 64.8251 9.5350 3.5742 2.3913 0.2633 9.7919 5.1613 3.5914 12.7864 3.1001 74.5102 13.2508 56.1958 20.0019 0.0476 12.2853 30.6909 16.8928 63.2817 0.0229 2.3245 0.6302 2.7246 0.1051 7.5299 8.1860 14.3219 22.9333 1.4896 0.1757 0.2627 0.9352 23.3117 28.8042 69.4045 20.4505 2.9467 0.3124 6.6794 19.2218 233.5952 76.5305 8.7192 8.6133 43.8862 0.4738 455.1795 182.1240 11.1267 13.9000 17.3422 7.5311 7.3414 1.0859 30.3511 32.0184 136.0046 48.9692 9.4107 37.7293
temp: 298.150 k
press: 1.00000 atm
elementType: 16 8 8 7 7 6 6 6 6 6 6 6 6 6 6 6 6 6 1 1 1 1 1 1 1 1 1 1 1 1
symmnumber: 1
zpe: 590535.6 jmol-1
zpe.correction: 0.224923 hartree
zpe.thermalcorrener: 0.241128 hartree
zpe.thermalcorrenthalpy: 0.242072 hartree
zpe.thermalcorrgfe: 0.182470 hartree
zpe.sumelectzpe: -1159.172340 hartree
zpe.sumelectthermal: -1159.156136 hartree
zpe.sumelectthermalent: -1159.155192 hartree
zpe.sumelectthermalfe: -1159.214793 hartree
dipole: 0.0000 4.8072 -4.8634
dipole: 6.8382
quadrupole: -61.5208 -111.3488 -121.1315
quadrupole: 0.0000 -0.0001 9.9169
quadrupole: 36.4796 -13.3485 -23.1311 0.0000 -0.0001 9.9169
hfenergy: -1159.3972636 hartree
pointgroup: C01 [X(C13H12N2O2S1)]
dipole: 0.0000831 -1.6176846 -2.1496925 debye
polarizability: 257.1591743|-0.000938|187.3489706|0.007069|-6.7995938|120.1222733 unknown
InChI: InChI=1S/C13H12N2O2S/c14-10-3-1-8-5-9-2-4-11(15)7-13(9)18(16,17)12(8)6-10/h1-4,6-7H,5,14-15H2
charge 0 multiplicity 1
30 atoms
S  -0.000007 1.365459 1.034013
O  -0.000089 1.285401 2.671603
O  0.000056 2.829562 0.29696
N  -4.736751 0.764999 -1.204024
N  4.736951 0.764826 -1.203529
C  -0.000066 -1.692112 1.101193
C  -1.421606 0.313005 0.379865
C  1.42162 0.312953 0.380009
C  -1.271803 -1.083708 0.512082
C  1.271753 -1.083754 0.51221
C  -2.520721 0.96585 -0.180476
C  2.520818 0.965758 -0.180218
C  -2.361867 -1.852425 0.036641
C  2.361838 -1.852511 0.036883
C  -3.608709 0.169757 -0.644123
C  3.608826 0.169625 -0.643752
C  -3.507277 -1.248501 -0.520588
C  3.507329 -1.248629 -0.520226
H  -0.000117 -1.521522 2.198387
H  -0.000078 -2.783605 0.940853
H  -2.525313 2.058847 -0.263433
H  2.525459 2.058755 -0.263173
H  -2.31027 -2.945902 0.09923
H  2.310196 -2.945986 0.099468
H  -4.33084 -1.878888 -0.876897
H  4.330908 -1.879046 -0.876446
H  -5.516565 0.201613 -1.529337
H  -4.807213 1.775072 -1.284013
H  5.516779 0.201412 -1.528757
H  4.80746 1.774896 -1.283507
