program: Gaussian 09
title: 000082406
version: EM64L-G09RevD.01
frameworkgroup: C1[X(C8H18O4)]
method: RPBEPBE
basis: SDD
operation: Freq
keyword: #pfreq=noraman
keyword: PBEPBE/SDD
title: #p freq=noraman PBEPBE/SDD
converged: YES YES NO NO
title: Mulliken charges:
elementType: O O O O C C C C C C C C H H H H H H H H H H H H H H H H H H
charge: -0.269614 -0.245687 -0.288357 -0.273838 0.067161 -0.269645 -0.257530 -0.698726 -0.239851 -0.271510 -0.494128 -0.497792 0.167795 0.197033 0.201723 0.260055 0.190204 0.240733 0.207843 0.224466 0.181759 0.212937 0.180539 0.204962 0.230650 0.201058 0.209343 0.231128 0.193923 0.203366
chargesum: 0.00000
title: Mulliken charges with hydrogens summed into heavy atoms:
elementType: O O O O C C C C C C C C
charge: -0.269614 -0.245687 -0.288357 -0.273838 0.234956 0.129110 0.192729 -0.025685 0.154845 0.113991 0.146923 0.130625
polarizability: 1.20428304e+02 5.65198522e-01 1.09743684e+02 2.64432894e+00 1.69894174e+00 8.39471028e+01
1716.lowfreq: -11.0411 -6.6530 -0.5117 -0.0006 -0.0003 0.0004 22.1131 36.5855 44.3893
frequency: 21.6650 36.5226 44.3470 55.1471 77.3467 79.9032 117.3475 133.6834 176.5845 195.5263 214.9036 224.5748 233.1712 276.2982 277.8822 296.8712 310.5487 379.6147 446.9887 512.6048 529.0427 557.6198 754.4464 796.8739 801.3478 809.6184 912.0245 931.6261 988.8850 996.1666 1031.1118 1036.1461 1055.0295 1061.3405 1069.6055 1093.9765 1106.5670 1110.8326 1117.6325 1122.1099 1153.7977 1158.9731 1164.8152 1203.1740 1205.0365 1255.5971 1261.4174 1317.0684 1322.6728 1368.0321 1370.4850 1385.2157 1390.7755 1404.4486 1435.9233 1436.1176 1456.4986 1457.1971 1457.8017 1459.2700 1459.5801 1462.4682 1466.0766 1471.8063 1478.4687 1479.9394 2893.8315 2913.6136 2920.8864 2925.2512 2929.2441 2943.3962 2952.1636 2982.1648 2987.9481 2988.0879 3002.1371 3006.2623 3012.9966 3032.9085 3098.2604 3102.2977 3111.0827 3114.6034
redmass: 3.0386 3.3895 3.3021 4.1572 2.9578 2.7180 2.4983 2.9276 3.0943 1.3693 1.3764 1.3242 1.6206 2.1854 2.2191 2.6988 3.1151 2.7541 4.0402 2.9922 2.9542 3.0904 2.8857 2.7006 2.7443 2.6526 2.8281 2.4311 2.7579 2.5455 2.5077 2.8287 2.5438 2.6950 2.8615 2.1126 1.8930 1.8208 1.6121 1.7930 1.6672 1.4411 1.7910 1.1351 1.1532 1.1222 1.1114 1.2431 1.2059 1.2687 1.2818 1.3226 1.3633 1.4725 1.1560 1.1473 1.0553 1.0525 1.0497 1.0726 1.0746 1.0768 1.0515 1.0812 1.0667 1.0672 1.0841 1.0402 1.0516 1.0524 1.0407 1.0633 1.0585 1.1005 1.1023 1.1019 1.1026 1.0353 1.1039 1.1002 1.0965 1.0974 1.1006 1.1001
irintensity: 1.7169 1.4506 0.4846 1.4111 1.8615 17.8475 1.8561 4.0175 2.2642 0.7174 1.7997 5.6572 1.0059 8.8248 2.7250 6.1015 0.6802 0.9787 11.5461 1.2344 0.8487 2.8734 28.1254 39.6505 19.9997 14.9866 127.4067 52.0269 28.9128 31.2491 94.3713 43.4661 5.0552 43.6448 151.3163 140.7112 7.4953 27.0126 7.1822 12.5279 8.6778 14.5717 6.1914 0.8629 11.7486 5.8758 5.6607 32.7980 35.8001 7.2978 2.3522 7.8740 28.6140 10.8427 0.1417 0.7446 10.6983 10.5573 3.9154 20.3103 24.3469 7.5864 0.8220 13.3710 4.6117 8.5709 59.9091 72.3180 26.5202 95.1476 109.2538 16.0573 99.0895 102.6266 55.1532 65.3616 61.1978 16.5907 57.4574 15.8750 34.6046 28.3348 27.5772 22.4144
temp: 298.150 k
press: 1.00000 atm
elementType: 8 8 8 8 6 6 6 6 6 6 6 6 1 1 1 1 1 1 1 1 1 1 1 1 1 1 1 1 1 1
symmnumber: 1
zpe: 672261.4 jmol-1
zpe.correction: 0.256051 hartree
zpe.thermalcorrener: 0.271929 hartree
zpe.thermalcorrenthalpy: 0.272873 hartree
zpe.thermalcorrgfe: 0.210457 hartree
zpe.sumelectzpe: -615.446442 hartree
zpe.sumelectthermal: -615.430564 hartree
zpe.sumelectthermalent: -615.429620 hartree
zpe.sumelectthermalfe: -615.492037 hartree
dipole: 2.2347 -1.8912 0.4128
dipole: 2.9566
quadrupole: -61.3531 -67.6760 -74.6353
quadrupole: 1.3603 4.4649 5.5993
quadrupole: 6.5351 0.2122 -6.7472 1.3603 4.4649 5.5993
hfenergy: -615.7024932 hartree
pointgroup: C01 [X(C8H18O4)]
dipole: -0.9373719 0.6685762 0.165427 debye
polarizability: 120.4074776|1.4835478|110.0073915|-1.2590448|-0.552047|83.7042218 unknown
InChI: InChI=1S/C8H18O4/c1-8(11-6-4-9-2)12-7-5-10-3/h8H,4-7H2,1-3H3
charge 0 multiplicity 1
30 atoms
O  -1.371178 -1.490524 -0.41689
O  0.982494 -0.97267 -0.433178
O  -2.414627 1.326685 0.080289
O  3.217882 0.776131 0.630727
C  -0.019379 -1.921603 -0.005316
C  -2.273088 -1.030305 0.647818
C  0.866521 0.346769 0.219382
C  0.296402 -3.239899 -0.700771
C  -3.17023 0.069405 0.092244
C  2.069218 1.178994 -0.188514
C  -3.145911 2.40351 -0.583456
C  4.453705 1.415845 0.193726
H  -0.002656 -2.00843 1.108642
H  -2.904259 -1.878927 0.987226
H  -1.710621 -0.638145 1.519777
H  -0.077919 0.832173 -0.093645
H  0.86064 0.227169 1.325441
H  0.196429 -3.107205 -1.790914
H  -0.406489 -4.023679 -0.372148
H  1.3293 -3.552497 -0.473327
H  -4.075843 0.179742 0.731646
H  -3.491353 -0.204008 -0.935922
H  1.852364 2.259737 -0.027752
H  2.279772 1.016718 -1.268237
H  -2.498962 3.293693 -0.53626
H  -4.107118 2.622097 -0.069868
H  -3.356044 2.15658 -1.645699
H  5.246628 1.051632 0.866233
H  4.393932 2.524653 0.26539
H  4.706788 1.142458 -0.853545
