program: Gaussian 09
title: 000000199
version: EM64L-G09RevD.01
frameworkgroup: C1[X(C5H14N4)]
method: RPBEPBE
basis: SDD
operation: Freq
keyword: #pfreq=noraman
keyword: PBEPBE/SDD
title: #p freq=noraman PBEPBE/SDD
converged: YES YES NO NO
title: Mulliken charges:
elementType: N N N N C C C C C H H H H H H H H H H H H H H
charge: -0.115980 -0.570532 -0.655178 -0.668552 -0.381087 -0.349792 -0.446420 -0.380087 0.243741 0.174035 0.200647 0.256527 0.159334 0.200007 0.178820 0.164983 0.207034 0.266123 0.254601 0.328670 0.293415 0.297515 0.342174
chargesum: 0.00000
title: Mulliken charges with hydrogens summed into heavy atoms:
elementType: N N N N C C C C C
charge: -0.115980 -0.049807 -0.033092 -0.028862 -0.006406 0.066069 -0.067594 -0.008069 0.243741
polarizability: 1.10979397e+02 -4.70853797e+00 7.99113258e+01 -6.00432385e+00 -2.68488850e+00 6.51002451e+01
1716.lowfreq: -280.5448 -12.3036 -5.5045 -0.0003 0.0004 0.0005 9.0312 28.9960 55.6086
frequency: -280.5444 28.7169 55.5961 69.9806 130.3076 161.9124 185.1316 233.0500 238.2623 278.6235 328.9162 355.8700 419.0047 436.6718 488.6607 490.3000 568.6563 601.1317 677.2681 753.8382 815.8403 874.8348 898.6141 953.3923 978.5022 999.5696 1032.8337 1066.6443 1091.6358 1113.2145 1138.9799 1184.7291 1209.2920 1231.3931 1279.9559 1283.9588 1300.9703 1348.1249 1361.8215 1386.1190 1419.8730 1453.9883 1457.1288 1474.7872 1494.0735 1592.9391 1623.1424 1634.5560 1670.5742 2848.4185 2849.6269 2895.3642 2946.7198 2971.1767 3006.5246 3029.7701 3066.9876 3444.2346 3563.8374 3572.6690 3573.2006 3708.1493 3728.8716
redmass: 1.1867 4.0405 3.8771 1.6952 2.5380 2.5187 3.2637 2.1080 1.1981 2.2246 1.2184 1.3313 2.9386 2.6573 2.1284 1.1694 3.0946 1.2734 8.0790 1.1862 1.6523 2.0256 1.7341 2.4518 1.8432 1.6071 1.9392 2.1908 2.2735 2.4947 1.3942 2.3347 1.2434 1.3992 1.1083 1.1484 1.2905 1.4387 1.4555 1.4919 4.0947 1.0836 1.0902 1.0787 1.0911 1.2576 1.3339 1.0943 3.3098 1.0571 1.0718 1.0985 1.0687 1.0617 1.0863 1.0967 1.0963 1.0445 1.0452 1.0970 1.0451 1.1033 1.1053
irintensity: 29.4150 9.6065 1.3414 5.8196 1.1325 4.6854 2.6193 12.8014 52.6023 3.6334 523.8689 4.8703 15.7037 1.3637 21.8836 57.8705 10.8950 223.4677 15.7918 3.1351 2.7672 2.8134 6.8118 6.9030 14.5312 2.0960 1.0437 1.8186 3.8562 19.6711 1.3701 7.9957 9.6110 2.0322 10.2064 0.2102 3.4421 54.6669 14.5324 22.5238 125.8892 7.2845 27.4297 4.7551 5.0720 145.1153 103.3105 41.5218 626.6177 96.3699 125.0393 70.7863 33.5535 76.4911 45.2986 39.1224 51.2912 3.7386 24.4553 0.5277 29.8747 21.0253 29.3214
temp: 298.150 k
press: 1.00000 atm
elementType: 7 7 7 7 6 6 6 6 6 1 1 1 1 1 1 1 1 1 1 1 1 1 1
symmnumber: 1
zpe: 526829.0 jmol-1
zpe.correction: 0.200659 hartree
zpe.thermalcorrener: 0.212249 hartree
zpe.thermalcorrenthalpy: 0.213193 hartree
zpe.thermalcorrgfe: 0.162428 hartree
zpe.sumelectzpe: -417.169257 hartree
zpe.sumelectthermal: -417.157667 hartree
zpe.sumelectthermalent: -417.156723 hartree
zpe.sumelectthermalfe: -417.207488 hartree
dipole: -2.9114 -1.4004 1.5657
dipole: 3.5901
quadrupole: -32.5485 -54.3746 -56.5142
quadrupole: -4.7595 -3.2251 -3.1947
quadrupole: 15.2639 -6.5622 -8.7018 -4.7595 -3.2251 -3.1947
hfenergy: -417.3699159 hartree
pointgroup: C01 [X(C5H14N4)]
dipole: 1.1489335 0.5106179 0.6435904 debye
dipolederiv: -1.4594164 0.4906856 -0.0739798 0.2736469 -0.604434 -0.0289732 -0.199598 0.0548818 -0.4523506 -0.5168151 -0.0057311 0.1167779 -0.0707028 -0.8069074 0.0886638 0.112745 0.066954 -0.2578659 -0.6829017 0.3376646 0.2353419 0.4877909 -1.0727188 -0.0068384 0.2949763 -0.0381894 -0.704002 -0.8366166 -0.2707807 -0.1306023 -0.4219737 -0.6336371 -0.1003451 -0.2383254 -0.0470137 -0.8138757 0.0099319 -0.0507092 -0.0121179 -0.0643039 0.1673001 0.0389592 -0.0424569 0.0302681 0.1135991 -0.1077733 -0.0292193 -0.0087006 -0.0295613 0.0085127 0.0716429 -0.064927 0.0532141 0.1575074 0.5083914 -0.2135194 -0.0665413 -0.3268119 0.4360431 -0.0394764 -0.0944741 -0.0094954 0.3346152 0.3748053 0.1171072 -0.140703 0.0303522 0.5584713 -0.0652402 -0.1065962 -0.1052275 0.2748077 1.8776921 -0.4708625 0.2774578 -0.3172694 1.2957259 0.4449383 0.4295348 0.3574557 0.5714365 -0.0343739 0.1142871 0.0082781 0.1006708 -0.1882131 -0.0128667 0.0443815 -0.055252 0.0657867 0.0652093 -0.0142603 -0.0118125 -0.0501824 0.0645952 -0.0448315 -0.0159802 0.0105013 -0.1783521 0.0985627 0.0707222 -0.0049621 0.1003848 -0.0798791 0.0005225 -0.021894 -0.0108274 0.0698226 0.0308638 -0.0277493 0.0091266 0.0023894 0.0487118 -0.0523707 0.0193462 -0.0234697 -0.2276529 -0.1101083 -0.1135886 0.0647448 0.0259737 -0.2493595 0.068127 0.0593759 0.088238 0.0210868 -0.0203719 0.0515102 -0.0126906 0.1202257 -0.045625 -0.0388478 0.0633921 -0.1342041 -0.246902 -0.0711266 0.0675553 0.009513 0.0736774 -0.344427 0.0688264 0.0272692 0.0130947 0.0241969 0.0599403 -0.0166169 0.0169357 -0.0279877 0.021397 -0.0512298 -0.0038304 -0.0209751 -0.1971751 -0.0720435 -0.1088609 -0.0498718 0.009321 0.3180854 0.0612143 -0.0233192 0.0684722 0.1593978 0.2245499 -0.076172 0.0331585 -0.0590872 0.2438408 -0.1200969 0.0366807 -0.0205718 -0.015897 0.1869801 0.000477 -0.0740802 0.0050982 0.2515451 -0.0595499 -0.0753786 -0.058953 0.333125 0.1363727 0.028094 -0.0802215 0.0317695 0.2150591 -0.0792183 -0.0821462 -0.0767367 0.3287013 0.1019318 0.0485048 -0.0850806 0.0407165 0.211557 -0.0779082 -0.1013505 -0.0772031 0.3295221 0.2363159 0.0714622 -0.0199702 0.0658634 0.1843567 -0.0651013 -0.0174247 -0.0649611 0.3104684 unknown
polarizability: 111.0100726|-5.1004034|79.5465085|5.5222816|3.5769103|65.4343869 unknown
InChI: InChI=1S/C5H14N4/c6-3-1-2-4-9-5(7)8/h1-4,6-8H2
charge 0 multiplicity 1
23 atoms
N  1.130992 -0.08931 -0.359021
N  -4.040225 -1.01721 0.47192
N  2.988481 -1.507211 -0.396685
N  3.202049 0.566312 0.714154
C  -0.983961 1.178355 -0.427687
C  -1.821495 0.084519 0.266193
C  0.488929 1.178951 0.034643
C  -3.268816 0.014257 -0.25674
C  2.379651 -0.307597 -0.01687
H  -1.427472 2.177862 -0.234774
H  -0.998504 1.01516 -1.523305
H  -1.330132 -0.893429 0.118437
H  -1.837218 0.277957 1.362008
H  1.003018 2.060196 -0.421392
H  0.507707 1.33339 1.143609
H  -3.722021 1.037174 -0.201011
H  -3.247919 -0.266092 -1.328148
H  -4.98699 -1.172274 0.11066
H  -4.039707 -0.879878 1.488523
H  2.410908 -2.159236 -0.918954
H  3.947019 -1.74451 -0.165241
H  4.161411 0.341534 0.962354
H  2.821694 1.455081 1.022526
