program: Gaussian 09
title: 000000196
version: EM64L-G09RevD.01
frameworkgroup: C1[X(C6H10O4)]
method: RPBEPBE
basis: SDD
operation: Freq
keyword: #pfreq=noraman
keyword: PBEPBE/SDD
title: #p freq=noraman PBEPBE/SDD
converged: NO YES NO NO
title: Mulliken charges:
elementType: O O O O C C C C C C H H H H H H H H H H
charge: -0.415841 -0.415856 -0.231509 -0.231448 -0.358935 -0.358875 -0.486293 -0.486367 0.175335 0.175301 0.214479 0.216789 0.214989 0.216299 0.254272 0.254858 0.254395 0.254793 0.376805 0.376810
chargesum: 0.00000
title: Mulliken charges with hydrogens summed into heavy atoms:
elementType: O O O O C C C C C C
charge: -0.039036 -0.039046 -0.231509 -0.231448 0.072333 0.072413 0.022837 0.022821 0.175335 0.175301
polarizability: 9.96058760e+01 -1.28181599e+00 7.77444302e+01 -1.78117973e-01 -9.55795192e-03 5.10883585e+01
1716.lowfreq: -15.3840 -6.3992 -0.0008 -0.0008 0.0000 5.0430 7.6693 35.4775 42.7636
frequency: -6.5647 35.1032 42.7634 70.5171 104.5850 122.6675 162.8811 247.5242 315.5249 447.4424 484.4245 501.0121 502.0084 573.0170 603.1499 635.4033 637.0918 724.3016 785.9553 852.6462 868.7334 902.0847 1018.8166 1024.8694 1071.7630 1079.9571 1088.5498 1104.9852 1139.4440 1226.0098 1234.7009 1247.0947 1277.3230 1287.3516 1289.3293 1333.4531 1376.0898 1381.1843 1437.5190 1440.4256 1466.7249 1481.4390 1670.0813 1671.2127 2987.5846 2989.3707 2993.7781 3000.8535 3025.3446 3034.8211 3050.3497 3070.3079 3513.8307 3514.1835
redmass: 11.9076 2.0614 4.3995 6.0031 2.6256 1.8816 8.1309 6.8054 5.2772 4.5794 3.7307 1.7524 1.8129 4.7897 4.6200 1.3195 1.3364 1.1378 1.4271 4.6380 4.9159 1.5090 2.9032 3.7641 2.0601 2.5319 1.8748 2.9200 1.2462 1.3411 1.2866 1.5385 1.6845 1.1382 1.0494 1.7719 1.8635 1.8631 1.0825 1.0870 1.0758 1.0955 8.3232 8.2286 1.0615 1.0614 1.0606 1.0590 1.0982 1.0989 1.1013 1.1032 1.0639 1.0639
irintensity: 2.6806 0.0003 0.0938 2.2962 0.0002 0.6844 0.0000 0.0002 4.4758 80.1769 0.1539 3.7626 57.5019 0.0157 18.6978 3.1099 254.5705 26.0168 0.0015 1.9010 0.0001 7.2326 0.0441 427.2658 162.5895 0.0059 0.1865 0.0060 0.7449 21.4719 0.0058 0.0003 72.5260 0.9017 0.0326 0.0032 91.1227 0.0014 53.9339 0.0028 0.0001 23.2498 417.9759 5.4078 0.0165 6.5130 0.0133 53.2675 0.0023 0.1607 0.0052 73.5596 23.3442 16.7241
temp: 298.150 k
press: 1.00000 atm
elementType: 8 8 8 8 6 6 6 6 6 6 1 1 1 1 1 1 1 1 1 1
symmnumber: 1
zpe: 413594.4 jmol-1
zpe.correction: 0.157530 hartree
zpe.thermalcorrener: 0.168058 hartree
zpe.thermalcorrenthalpy: 0.169003 hartree
zpe.thermalcorrgfe: 0.119284 hartree
zpe.sumelectzpe: -534.759913 hartree
zpe.sumelectthermal: -534.749384 hartree
zpe.sumelectthermalent: -534.748440 hartree
zpe.sumelectthermalfe: -534.798158 hartree
dipole: 0.0006 0.0005 0.0249
dipole: 0.0249
quadrupole: -50.5200 -70.3148 -57.2176
quadrupole: -8.0688 -0.0409 -0.0654
quadrupole: 8.8308 -10.9640 2.1332 -8.0688 -0.0409 -0.0654
hfenergy: -534.9174424 hartree
pointgroup: C01 [X(C6H10O4)]
dipole: -0.0002423 -0.0002972 0.0097934 debye
dipolederiv: -1.0046707 0.5561204 -0.0081563 0.4863269 -0.6465721 0.0059516 -0.0111745 0.0071909 -0.4331648 -1.0056713 0.5560625 0.0060713 0.4861944 -0.6460328 -0.0006989 0.0036859 -0.0002646 -0.4331089 -0.6817495 -0.1613802 -0.0015523 0.0985644 -0.9687626 0.0038779 -0.0045748 0.0005113 -0.3054318 -0.6817782 -0.1610671 -0.0043997 0.0989677 -0.9686479 -0.0110355 -0.0007498 -0.0125022 -0.3054974 0.038919 0.0008135 -0.0006398 0.0104543 0.059329 -0.0028178 0.0018779 -0.0015026 0.1664639 0.0388835 0.000845 -0.0003654 0.010832 0.0594165 -0.003591 0.0002754 -0.0030497 0.1663812 -0.2737212 -0.096925 -0.0059177 -0.2718137 -0.0891158 -0.0053515 -0.0146936 -0.00569 0.1509671 -0.2733398 -0.0969366 -0.0051501 -0.2720817 -0.0892383 -0.0073941 -0.0128313 -0.007245 0.1509003 1.4863298 -0.1846225 0.0163723 -0.261963 1.3963343 -0.0074551 0.0232446 -0.0061392 0.186516 1.4868946 -0.1848959 0.0057382 -0.2624457 1.3958586 0.0196051 0.0071055 0.0201553 0.186623 0.0509605 0.0053929 0.0004334 0.0090759 -0.0038453 -0.1013834 -0.0106548 -0.1080977 -0.0757875 0.0546907 0.0039718 0.0008417 0.0077917 -0.0178712 0.1039971 0.011758 0.1098424 -0.0564174 0.051871 0.0053425 0.0004807 0.0092951 -0.0035616 -0.101178 -0.0103112 -0.1075757 -0.0748587 0.0537432 0.0040167 0.0008423 0.0075358 -0.0182143 0.1042668 0.0121415 0.1103399 -0.0573027 0.0651733 -0.0108955 -0.0024617 0.036637 0.0438354 -0.0812813 0.011524 -0.1031308 -0.0189897 0.064466 -0.0089002 0.0017362 0.0394124 0.0316623 0.085133 -0.0057118 0.1069122 -0.0062134 0.0649684 -0.0101782 -0.0022545 0.0374103 0.0440728 -0.0813594 0.0108022 -0.1032892 -0.0191338 0.0646477 -0.0096687 0.0018738 0.038768 0.0314588 0.0851195 -0.0064949 0.106791 -0.0060037 0.1995863 -0.1035793 -0.0008575 -0.154536 0.1949871 -0.0002796 -0.0014263 0.0004432 0.3920557 0.1997965 -0.1035161 -0.002635 -0.1544258 0.1949072 -0.0041254 -0.0037921 -0.0036997 0.3920027 unknown
polarizability: 99.5811773|-1.4735406|77.7656616|0.2562153|0.2640793|51.0918258 unknown
InChI: InChI=1S/C6H10O4/c7-5(8)3-1-2-4-6(9)10/h7,9H,1-4H2
charge 0 multiplicity 1
20 atoms
O  4.249995 -0.864156 0.010621
O  -4.261555 0.868143 -0.006212
O  3.425185 1.305105 -0.010307
O  -3.435397 -1.3004 -0.03705
C  0.672922 0.369212 0.009853
C  -0.683916 -0.364536 -0.023943
C  1.855893 -0.615971 -0.021959
C  -1.866856 0.620611 0.007071
C  3.204714 0.074763 -0.007298
C  -3.215598 -0.070199 -0.01497
H  0.744396 0.996405 0.91925
H  0.753397 1.064663 -0.847419
H  -0.755273 -0.992794 -0.932559
H  -0.764331 -1.05908 0.834096
H  1.815432 -1.257447 -0.924518
H  1.820548 -1.313279 0.837538
H  -1.829467 1.260778 0.910468
H  -1.828484 1.319361 -0.851345
H  5.121197 -0.381932 0.016006
H  -5.132501 0.385652 -0.019024
