program: Gaussian 09
title: 000082288
version: EM64L-G09RevD.01
frameworkgroup: C1[X(C12H9ClO)]
method: RPBEPBE
basis: SDD
operation: Freq
keyword: #p
keyword: freq=noraman
keyword: PBEPBE/SDD
title: #p freq=noraman PBEPBE/SDD
converged: YES YES NO NO
title: Mulliken charges:
elementType: Cl O C C C C C C C C C C C C H H H H H H H H H
charge: -0.106963 -0.093387 0.242794 0.419417 0.198912 0.335406 -0.441377 -0.434405 -0.355398 -0.424738 -0.808792 -0.251178 -0.241709 -0.228536 0.242884 0.241511 0.258192 0.243021 0.244123 0.230869 0.261333 0.233904 0.234117
chargesum: 0.00000
title: Mulliken charges with hydrogens summed into heavy atoms:
elementType: Cl O C C C C C C C C C C C C
charge: -0.106963 -0.093387 0.242794 0.419417 0.198912 0.335406 -0.198493 -0.192894 -0.097206 -0.181717 -0.072466 -0.017274 -0.007592 -0.228536
polarizability: 1.90817241e+02 1.43632046e+01 1.70800182e+02 6.04246383e+00 -4.34135533e+00 7.49388101e+01
1716.lowfreq: -9.1530 0.0011 0.0012 0.0026 3.1786 10.1827 47.9247 72.2997 108.8149
frequency: 47.9237 72.2873 108.8134 128.8158 158.2602 177.0153 239.6927 268.6930 313.5649 362.2799 401.1480 417.3925 444.6073 451.0992 509.5773 521.0148 537.2205 616.1421 646.8918 682.9765 705.1581 750.7164 764.3488 798.2193 833.6027 857.1046 889.4592 916.4125 962.6180 982.8028 997.3216 1012.8680 1036.7774 1044.9044 1068.7068 1156.6535 1177.3092 1188.6067 1240.4041 1243.3760 1285.8940 1346.2723 1393.2451 1402.4170 1412.0118 1428.2074 1459.6872 1467.3647 1477.0759 1517.5937 1563.4423 1599.1076 1630.0554 1715.5454 2990.8261 3071.9833 3097.3337 3126.4825 3127.9429 3141.1374 3151.8150 3160.3878 3175.5796
redmass: 12.1469 5.1469 3.5413 1.0642 7.6647 4.7709 5.3166 3.9067 4.1900 8.1190 4.5807 4.6466 4.7533 4.6215 3.3092 5.3913 4.7061 4.1656 6.9108 4.9726 5.4193 2.4430 1.9536 2.7503 1.3293 4.9144 1.7421 3.9044 1.3449 1.4070 1.3509 1.9867 2.2275 1.5632 2.7973 1.4203 1.2264 1.3852 1.8240 2.9665 1.7435 2.9063 4.0307 1.4449 2.4160 3.4601 2.1675 1.1110 1.0956 3.3741 6.9546 6.2258 6.4867 12.6768 1.0373 1.0972 1.0998 1.0874 1.0867 1.0899 1.0975 1.0958 1.0981
irintensity: 1.3601 0.3851 1.9557 0.1784 2.4623 1.1778 1.2970 4.7607 1.5989 2.0995 13.8482 4.7771 19.8424 5.1504 2.2623 30.1510 16.9344 15.1266 14.2005 10.2423 22.4012 39.8891 78.9264 37.2133 55.6268 52.1703 2.9923 3.0629 0.5888 4.3841 0.2588 5.7165 8.8716 10.5490 32.5135 16.8772 11.0712 29.1718 6.9217 18.2442 2.8812 2.4691 20.9845 23.9881 0.4822 6.8271 11.1696 14.0592 9.2328 32.2681 9.8477 15.9047 8.7472 304.4272 14.4695 7.7991 18.0980 1.6139 3.1677 10.9468 24.8827 23.8454 13.4013
temp: 298.150 k
press: 1.00000 atm
elementType: 17 8 6 6 6 6 6 6 6 6 6 6 6 6 1 1 1 1 1 1 1 1 1
symmnumber: 1
zpe: 451435.9 jmol-1
zpe.correction: 0.171943 hartree
zpe.thermalcorrener: 0.183931 hartree
zpe.thermalcorrenthalpy: 0.184875 hartree
zpe.thermalcorrgfe: 0.133154 hartree
zpe.sumelectzpe: -997.010525 hartree
zpe.sumelectthermal: -996.998537 hartree
zpe.sumelectthermalent: -996.997593 hartree
zpe.sumelectthermalfe: -997.049314 hartree
dipole: -3.0039 2.9550 -0.1958
dipole: 4.2183
quadrupole: -83.4729 -79.0671 -93.6884
quadrupole: 7.1525 -1.4484 -3.6564
quadrupole: 1.9366 6.3424 -8.2789 7.1525 -1.4484 -3.6564
hfenergy: -997.1824681 hartree
pointgroup: C01 [X(C12H9Cl1O1)]
dipole: -1.0082202 -1.3108804 -0.1390428 debye
dipolederiv: -0.220349 -0.0190726 0.0506034 -0.1577373 -0.6742584 -0.4385325 -0.0586461 -0.4968153 -0.6812905 -0.8214205 -0.1572942 0.506423 -0.2272128 -0.4281012 -0.0110945 0.3082466 -0.1632706 -0.753985 0.2002015 0.0441291 0.0270589 -0.2594899 -0.0527106 -0.0228115 -0.0745577 -0.0961131 0.0219907 -0.0045453 -0.074111 0.002143 0.0427256 -0.2219499 0.0107233 -0.0126797 0.0053959 0.0567915 -0.285894 -0.113705 0.0748356 -0.3321628 -0.4910416 -0.0656084 0.0548576 -0.0529578 -0.1568591 0.4015855 -0.235329 -0.0719565 0.256276 0.1500167 -0.013239 0.0173457 0.1007304 -0.0007762 0.2204079 0.0419447 -0.0220523 -0.1129568 0.1613835 -0.0222454 -0.0101707 -0.0155476 -0.1297013 -0.4550619 -0.0102044 0.0085939 -0.1509104 0.0970843 0.0008998 0.0231004 -0.0094543 -0.163026 -0.1493189 0.0589369 -0.0309765 0.1353851 0.0736737 -0.014983 0.0195379 0.0089521 -0.1260657 0.0665657 0.0130286 -0.007924 0.1172295 0.085248 -0.0114459 -0.0181623 0.0019068 -0.1700703 -0.2309363 0.0666886 0.0281524 -0.0538497 0.1262199 -0.0096405 0.0723276 -0.0537958 0.015692 -0.0284341 -0.0011717 0.0025831 -0.0162517 0.1864987 -0.0201397 -0.0147438 -0.0207846 -0.1412425 0.1289282 0.0260895 -0.0142835 0.031751 -0.147944 -0.0062025 -0.0092417 0.0031752 -0.1532301 1.0246979 0.4075974 -0.5923728 0.7177458 1.2806144 0.5653529 -0.3018124 0.7206605 1.3746602 0.0054356 -0.1165523 0.0106505 -0.0564368 -0.0203107 0.0108296 0.0116384 0.0130876 0.1462503 0.038197 0.092362 0.0003185 0.0596924 -0.0807962 -0.0027413 -0.0080532 0.0001398 0.1547971 0.0544624 -0.086738 0.0257584 -0.0389694 0.0072049 0.0137991 0.0255383 0.005953 0.1365039 0.0200213 -0.0488018 0.0059631 -0.1193397 -0.047098 0.013736 0.0155305 0.0108554 0.1561066 0.0063089 -0.001749 -0.0420419 -0.0469429 0.0345005 -0.0920226 -0.0840254 -0.0559723 0.0089788 0.0817671 -0.014389 -0.0004295 0.0998812 -0.1405039 0.0249601 -0.0250616 0.0447496 0.1124746 0.0316381 0.0310273 0.0366717 -0.0048232 0.0928656 0.0700266 0.0650235 0.0356397 -0.0239261 0.0468362 0.0717129 -0.0048241 0.0864 -0.0808915 0.0168834 -0.0034551 0.0107875 0.1543832 -0.1310931 0.025601 0.0071055 0.0299967 0.0902958 0.0034959 0.0074632 0.0026778 0.1615439 unknown
polarizability: 194.470692|-10.1365404|166.5343292|-6.2358462|9.4678102|75.5512125 unknown
InChI: InChI=1S/C12H9ClO/c1-8-6-7-9-4-2-3-5-10(9)11(8)12(13)14/h2-7H,1H3
charge 0 multiplicity 1
23 atoms
Cl 1.720159 2.392255 1.400414
O  2.831043 1.36984 -0.870507
C  -0.501881 0.271902 0.000398
C  -1.372758 -0.883005 0.080802
C  0.928498 0.051375 -0.052669
C  1.479487 -1.255054 -0.077414
C  -0.795298 -2.192464 0.099515
C  0.583991 -2.368756 0.015937
C  -1.10756 1.570494 -0.073658
C  -2.794137 -0.701582 0.121582
C  2.971782 -1.521702 -0.166916
C  -2.496709 1.716704 -0.038965
C  -3.351671 0.575928 0.068008
C  1.897806 1.173993 -0.097099
H  -1.458456 -3.062481 0.172575
H  1.009677 -3.377937 0.024814
H  -0.477629 2.459631 -0.15965
H  -3.435887 -1.588114 0.185681
H  3.546738 -0.941747 0.577463
H  3.182752 -2.590762 -0.001341
H  3.368181 -1.241813 -1.15947
H  -2.937053 2.717934 -0.096281
H  -4.438075 0.710063 0.09758
