program: Gaussian 09
title: 000082229
version: EM64L-G09RevD.01
frameworkgroup: C1[X(C10H16O)]
method: RPBEPBE
basis: SDD
operation: Freq
keyword: #pfreq=noraman
keyword: PBEPBE/SDD
title: #p freq=noraman PBEPBE/SDD
converged: YES YES NO NO
title: Mulliken charges:
elementType: O C C C C C C C C C C H H H H H H H H H H H H H H H H
charge: -0.189268 0.323429 -0.203109 0.279987 -0.601982 -0.528652 -0.467963 0.034652 -0.795639 -0.760416 -0.748833 0.243901 0.243007 0.229113 0.242276 0.237258 0.221487 0.222473 0.221847 0.208277 0.235206 0.221272 0.213112 0.237566 0.217108 0.224082 0.239809
chargesum: 0.00000
title: Mulliken charges with hydrogens summed into heavy atoms:
elementType: O C C C C C C C C C C
charge: -0.189268 0.323429 0.040792 0.279987 -0.129862 -0.049118 -0.024004 0.034652 -0.130308 -0.088467 -0.067833
polarizability: 1.09921410e+02 -5.95756828e-01 1.02214737e+02 3.32197801e-01 1.05917755e+00 9.30861239e+01
1716.lowfreq: -29.9629 -20.8288 -15.8191 -0.0004 0.0003 0.0004 77.5719 150.8100 160.0792
frequency: 77.5509 150.7705 160.0418 179.5187 193.9872 211.2960 247.5990 277.4855 289.8425 316.9430 361.1132 409.0159 430.3782 495.1481 506.4415 581.7369 643.3551 699.0551 761.6515 814.2992 819.2781 824.0497 881.5189 883.2518 924.9766 943.9506 949.2051 956.3053 985.9435 995.2285 1006.5433 1019.7375 1061.1376 1093.6693 1110.8940 1148.6163 1159.4667 1196.7832 1209.9602 1218.2159 1236.0585 1247.7180 1257.0428 1277.9018 1309.2418 1325.0977 1370.2994 1390.0722 1392.9885 1455.5553 1462.6925 1464.4622 1470.5333 1472.2662 1477.0135 1480.6165 1487.2228 1504.2432 1655.7590 2979.1750 2980.4341 2982.7870 2998.1028 3010.6573 3016.5510 3056.2806 3057.6008 3072.1566 3073.6619 3075.7923 3078.2953 3079.0225 3083.4887 3086.5283 3090.5422
redmass: 3.6176 1.1345 1.0946 2.3220 1.7324 1.3848 2.4362 3.5200 2.4159 2.3415 2.1632 2.8266 2.1355 3.0346 3.4444 3.7792 3.5219 4.8366 3.2337 1.4505 3.0740 2.5502 2.2427 2.4707 2.3092 1.7388 1.6157 1.8576 1.4352 1.4131 2.0488 1.5597 1.3196 1.2299 2.2113 1.9304 2.3968 2.0790 1.6585 2.4780 1.6376 1.5114 1.8888 1.6933 1.5637 2.5710 1.1846 1.2136 1.2300 1.0581 1.0628 1.0537 1.0606 1.0692 1.0630 1.0676 1.0740 1.0747 11.1179 1.0350 1.0363 1.0360 1.0595 1.0604 1.0647 1.1021 1.0901 1.1022 1.0997 1.1014 1.0987 1.0995 1.1030 1.0996 1.0984
irintensity: 2.4886 0.3303 0.1345 1.1742 0.6224 0.9910 0.4227 6.4039 0.4975 0.1839 0.6430 0.2762 1.1759 1.0824 1.3425 0.9673 3.1876 0.7569 0.3314 5.0455 4.6463 0.7243 1.0694 1.2939 11.3070 10.2856 1.5170 8.8251 8.7006 7.5702 41.8104 3.0218 2.7663 9.4061 2.9294 4.1208 1.7914 1.9585 3.9363 0.8660 0.8167 3.3408 2.5812 6.5001 1.5678 1.4752 13.7411 18.8717 16.8727 2.5003 3.6280 3.5567 11.9836 6.2473 5.9210 20.2780 19.9695 9.0130 150.6810 28.0806 36.8859 23.9857 33.2988 37.9713 44.0903 1.8452 44.1220 4.8012 12.4146 9.8770 27.7208 38.3267 81.6526 44.2417 15.1540
temp: 298.150 k
press: 1.00000 atm
elementType: 8 6 6 6 6 6 6 6 6 6 6 1 1 1 1 1 1 1 1 1 1 1 1 1 1 1 1
symmnumber: 1
zpe: 619987.5 jmol-1
zpe.correction: 0.236141 hartree
zpe.thermalcorrener: 0.247369 hartree
zpe.thermalcorrenthalpy: 0.248313 hartree
zpe.thermalcorrgfe: 0.200522 hartree
zpe.sumelectzpe: -465.018892 hartree
zpe.sumelectthermal: -465.007663 hartree
zpe.sumelectthermalent: -465.006719 hartree
zpe.sumelectthermalfe: -465.054511 hartree
dipole: -0.1247 2.9120 1.3854
dipole: 3.2272
quadrupole: -64.7702 -74.0619 -67.9597
quadrupole: -0.2899 0.2688 -3.6704
quadrupole: 4.1604 -5.1313 0.9709 -0.2899 0.2688 -3.6704
hfenergy: -465.2550325 hartree
pointgroup: C01 [X(C10H16O1)]
dipole: -0.1006143 1.1608224 0.5044351 debye
polarizability: 109.9646759|-0.2019172|102.2406048|0.1480458|0.7458263|93.0169899 unknown
InChI: InChI=1S/C10H16O/c1-9(2)7-4-5-10(3,6-7)8(9)11/h7H,4-6H2,1-3H3
charge 0 multiplicity 1
27 atoms
O  0.203414 -2.048207 -0.833764
C  -1.245007 -0.250963 0.131259
C  0.428179 1.263759 0.638171
C  1.241583 0.034914 0.089845
C  -0.761967 0.567677 1.370009
C  -1.421682 0.913926 -0.925628
C  -0.33675 1.973292 -0.519468
C  0.07595 -0.928803 -0.281353
C  -2.441995 -1.187007 0.270091
C  2.14464 0.298366 -1.138657
C  2.114942 -0.613373 1.203927
H  1.041391 1.942322 1.254515
H  -0.465996 -0.067178 2.222485
H  -1.527709 1.286336 1.714208
H  -2.446109 1.319208 -0.833215
H  -1.303102 0.546891 -1.960794
H  0.317913 2.26306 -1.357728
H  -0.811502 2.896781 -0.141053
H  -2.264507 -1.953575 1.046014
H  -3.354793 -0.624545 0.540572
H  -2.630499 -1.722302 -0.677857
H  1.580469 0.674963 -2.009144
H  2.932887 1.033806 -0.891508
H  2.630985 -0.644342 -1.447028
H  2.97548 0.042914 1.432118
H  1.556308 -0.781489 2.141035
H  2.502578 -1.588431 0.858645
