program: Gaussian 09
title: 000082140
version: EM64L-G09RevD.01
frameworkgroup: C1[X(C3H5N3)]
method: RPBEPBE
basis: SDD
operation: Freq
keyword: #p
keyword: freq=noraman
keyword: PBEPBE/SDD
title: #p freq=noraman PBEPBE/SDD
converged: NO NO NO NO
title: Mulliken charges:
elementType: N N N C C C H H H H H
charge: -0.399500 -0.133981 -0.625841 0.198935 -0.210824 -0.269023 0.297195 0.254835 0.245719 0.336144 0.306341
chargesum: 0.00000
title: Mulliken charges with hydrogens summed into heavy atoms:
elementType: N N N C C C
charge: -0.102305 -0.133981 0.016644 0.198935 0.044011 -0.023305
polarizability: 6.69671121e+01 -4.93651697e-01 5.41099938e+01 2.05549349e-03 -1.74539721e-04 2.31358927e+01
1716.lowfreq: -180.0055 -9.7685 -0.0007 0.0009 0.0010 12.1847 18.7609 278.7296 363.7746
frequency: -179.9983 278.7280 363.7674 377.5235 547.6608 609.2768 659.8159 699.9439 701.8384 824.4092 896.7806 943.7305 986.3872 1081.1145 1089.0550 1181.1584 1283.0382 1321.4263 1420.3252 1498.1765 1578.9045 1634.6789 3225.7209 3257.5644 3586.6733 3593.2303 3734.8331
redmass: 1.1627 3.7877 1.1566 2.6632 1.2213 3.0849 1.4295 5.8400 4.1067 1.3270 6.7903 2.4980 1.9066 1.6199 1.7390 2.5336 1.7140 2.4881 3.8105 3.8902 1.6654 2.2868 1.0913 1.1089 1.0483 1.0779 1.1051
irintensity: 132.7966 25.4893 196.4416 7.0560 128.5393 3.7218 106.8953 3.8817 14.7376 14.7581 1.5053 4.8826 14.2145 27.9384 2.5227 18.3467 8.4511 3.6964 38.8750 0.3386 40.1427 419.8832 4.5074 4.5610 68.7791 24.1603 41.7531
temp: 298.150 k
press: 1.00000 atm
elementType: 7 7 7 6 6 6 1 1 1 1 1
symmnumber: 1
zpe: 223556.7 jmol-1
zpe.correction: 0.085148 hartree
zpe.thermalcorrener: 0.090129 hartree
zpe.thermalcorrenthalpy: 0.091073 hartree
zpe.thermalcorrgfe: 0.057147 hartree
zpe.sumelectzpe: -281.115381 hartree
zpe.sumelectthermal: -281.110400 hartree
zpe.sumelectthermalent: -281.109456 hartree
zpe.sumelectthermalfe: -281.143382 hartree
dipole: 1.9627 3.9696 0.0010
dipole: 4.4283
quadrupole: -25.1371 -32.2983 -39.5583
quadrupole: 1.1441 0.0026 0.0005
quadrupole: 7.1941 0.0329 -7.2270 1.1441 0.0026 0.0005
hfenergy: -281.2005294 hartree
pointgroup: C01 [X(C3H5N3)]
dipole: -0.7774896 1.5591344 -0.0004113 debye
dipolederiv: -0.3406361 0.2481294 0.0000282 -0.1064485 -0.5260566 0.0000897 0.0000813 0.0001764 -0.2822784 -0.7924451 -0.106483 -0.000048 0.3558396 -0.5172293 0.0000045 -0.000062 0.0000536 -0.2973345 -1.457503 -0.0204871 0.0000633 0.0679058 -0.1946427 -0.0001608 0.0002871 -0.0001793 -0.7926888 1.6419024 0.0501681 -0.0000126 -0.2148348 0.5538678 -0.0000941 -0.0000173 -0.0000128 0.1867103 -0.0334102 -0.3018344 0.0000819 -0.2185192 0.0383316 -0.00003 -0.0000919 -0.0001619 -0.2748539 0.3763796 0.0861303 -0.0000058 0.0557765 0.1369915 0.0000563 0.0000644 -0.0000721 -0.1932756 0.1639668 0.0103063 -0.0000245 0.0324104 0.1157626 0.0000124 -0.000018 -0.0000097 0.3732116 0.0283796 -0.0564946 -0.0000257 -0.093001 0.0252532 -0.000011 0.000015 0.0000265 0.2553034 -0.0152242 0.0633446 0.0000046 0.1030463 0.0564824 -0.0000019 -0.0000159 0.0000443 0.1932363 0.2287617 0.0332247 -0.000035 0.0433468 0.1800137 0.0000367 -0.0000861 0.0000106 0.4114731 0.1998284 -0.0060044 -0.0000264 -0.0255218 0.1312259 0.000098 -0.0001566 0.0001242 0.4204964 unknown
polarizability: 66.9635977|0.5374607|54.1135081|0.0020549|0.0001815|23.1358927 unknown
InChI: InChI=1S/C3H5N3/c4-3-5-1-2-6-3/h1-2,5H,4H2
charge 0 multiplicity 1
11 atoms
N  0.05832 1.151028 -0.000145
N  0.00442 -1.118426 0.000127
N  -2.127153 0.040147 -0.000042
C  -0.741396 0.00577 -0.000045
C  1.407676 0.717587 0.000155
C  1.343239 -0.67152 -0.000068
H  -0.251499 2.121015 -0.000195
H  2.241203 1.414098 0.000263
H  2.165361 -1.383293 -0.000093
H  -2.61368 -0.850455 0.000008
H  -2.65659 0.90465 -0.000466
