program: Gaussian 09
title: 000000189
version: EM64L-G09RevD.01
frameworkgroup: C1[X(C5H9NO4)]
method: RPBEPBE
basis: SDD
operation: Freq
keyword: #pfreq=noraman
keyword: PBEPBE/SDD
title: #p freq=noraman PBEPBE/SDD
converged: YES YES NO NO
title: Mulliken charges:
elementType: O O O O N C C C C C H H H H H H H H H
charge: -0.270463 -0.414183 -0.237346 -0.242396 -0.575016 -0.223438 -0.263095 0.198606 0.306742 -0.754339 0.268369 0.258229 0.241340 0.288597 0.296068 0.248403 0.251868 0.246221 0.375836
chargesum: 0.00000
title: Mulliken charges with hydrogens summed into heavy atoms:
elementType: O O O O N C C C C C
charge: -0.270463 -0.038347 -0.237346 -0.242396 0.009649 0.044931 0.236473 0.198606 0.306742 -0.007847
polarizability: 8.34905649e+01 -2.06477534e+00 7.79859081e+01 5.76405396e+00 2.72881617e+00 6.24207348e+01
1716.lowfreq: -0.0007 -0.0005 0.0005 0.6915 4.0451 11.5034 25.9214 36.4480 51.4514
frequency: 25.8741 36.4066 51.2896 58.7809 114.8804 163.5171 222.0962 245.6619 267.3864 292.4691 329.3180 436.3377 488.2980 566.2573 581.3465 589.5103 621.9212 632.5781 713.5172 775.1931 841.5051 940.2888 988.8000 1008.0770 1036.8185 1045.0568 1056.2417 1118.2189 1167.0247 1200.1694 1217.7322 1247.0315 1331.1029 1359.3521 1372.9729 1386.0185 1454.4717 1456.6293 1461.7903 1639.7246 1654.2097 1657.5054 3006.6438 3024.8235 3078.5923 3100.6275 3106.8799 3140.6813 3474.1649 3498.3842 3608.6928
redmass: 8.5683 5.9933 1.7802 1.6464 3.9591 6.1606 3.5374 2.7322 3.8086 1.2816 2.9870 4.0309 3.5734 3.0616 2.4587 1.5206 3.9279 1.4483 3.9438 3.5816 6.1942 3.2658 1.6812 2.3027 3.1605 1.6705 1.8898 3.1461 1.3040 3.3957 1.4195 1.5308 1.3705 1.6784 1.4496 1.2635 1.0574 1.0541 1.0784 1.1425 9.4817 6.4308 1.0384 1.0587 1.0875 1.0939 1.1062 1.1025 1.0450 1.0639 1.0990
irintensity: 1.1763 0.9036 1.7208 1.1214 2.3241 2.8535 5.7727 6.3233 6.5063 53.9292 12.0085 19.6157 32.0454 0.6993 33.1776 260.4666 12.0579 135.8152 34.0910 3.4871 26.5801 25.3086 13.3197 95.6698 141.1644 21.5344 142.2066 17.9574 5.2558 325.0858 16.0816 7.8688 4.6787 13.7193 3.2164 52.7108 16.9183 20.8049 18.8429 65.5699 208.9993 174.3805 1.9412 10.7590 5.2300 8.2193 16.4562 8.8255 5.8904 17.7154 8.8007
temp: 298.150 k
press: 1.00000 atm
elementType: 8 8 8 8 7 6 6 6 6 6 1 1 1 1 1 1 1 1 1
symmnumber: 1
zpe: 382164.2 jmol-1
zpe.correction: 0.145559 hartree
zpe.thermalcorrener: 0.157351 hartree
zpe.thermalcorrenthalpy: 0.158295 hartree
zpe.thermalcorrgfe: 0.105538 hartree
zpe.sumelectzpe: -550.787236 hartree
zpe.sumelectthermal: -550.775444 hartree
zpe.sumelectthermalent: -550.774500 hartree
zpe.sumelectthermalfe: -550.827257 hartree
dipole: -2.3500 -1.7235 -1.7208
dipole: 3.3844
quadrupole: -51.5426 -56.2616 -63.2157
quadrupole: -7.1913 -2.5644 -0.0965
quadrupole: 5.4640 0.7450 -6.2091 -7.1913 -2.5644 -0.0965
hfenergy: -550.9327951 hartree
pointgroup: C01 [X(C5H9N1O4)]
dipole: 0.8706324 -0.6941921 0.7301218 debye
dipolederiv: -1.6212991 -0.1466477 -0.2658873 -0.1583115 -0.4679632 0.0605736 -0.3087513 0.059197 -0.3865027 -0.5474391 0.2551942 -0.2639548 0.2497377 -0.7701885 0.4791939 -0.201373 0.3974777 -0.5986932 -0.4134346 0.1519494 0.0208133 0.1229647 -0.5690643 -0.1513868 -0.1503081 -0.0335451 -0.9621349 -0.7444744 -0.0189682 -0.0901257 0.2938229 -0.7271296 0.2695371 -0.2883977 0.187584 -0.4707911 -0.5742928 0.0409077 0.0868079 -0.0220191 -0.8586289 -0.2125941 0.0545815 -0.1792963 -0.2744049 0.4394424 0.0831551 -0.0721065 0.086867 0.2720274 0.0198285 -0.0380446 0.0218598 0.1591512 0.627875 0.1135398 -0.0037412 0.3117667 0.2938993 0.0673504 -0.0900302 -0.0111986 0.2703403 0.4181515 -0.4774614 0.2398563 -0.5226054 1.0454227 -0.1483165 0.2688028 -0.2085066 1.2808656 1.7816757 0.1723172 0.3538247 -0.1330302 0.9690777 -0.383356 0.6273752 -0.2798362 0.4979763 -0.1687242 -0.1604835 0.0087543 -0.221316 -0.2957346 0.0535527 -0.0297732 0.0054605 0.0204061 0.0661597 -0.0117554 -0.0024049 -0.0070781 0.0418581 0.0310525 0.0124547 0.0177228 -0.0745813 -0.0214095 0.0374965 0.0308163 -0.0291672 -0.0497391 -0.0648008 0.0399512 -0.0564444 0.0441897 0.0133021 -0.0405459 -0.0031503 -0.0821373 0.0564436 -0.0045552 0.0342012 0.0514305 -0.0636611 0.204271 -0.0794471 0.0076517 -0.0629816 0.334659 -0.0315566 0.0153951 0.0253727 0.0530369 0.0548192 -0.0325298 -0.0722018 0.0415808 0.2837699 0.1233623 -0.0113191 0.112218 0.2170018 0.090364 0.0120396 -0.0720427 0.0115159 0.0879972 0.0626017 -0.0306429 0.0964763 -0.0295395 0.1067628 0.0097242 0.0463555 -0.0089995 0.0376687 -0.0722962 0.0301538 -0.0893956 0.0057478 -0.0861986 0.0209699 0.017486 0.0585561 0.0822166 0.0056834 0.0158627 0.030231 0.1231888 0.3744491 0.0705455 0.0332492 0.0708339 0.233408 -0.1038739 0.0498619 -0.1468075 0.1884044 unknown
polarizability: 82.9223057|2.1353859|77.8427133|6.7706033|-2.882758|63.1321889 unknown
InChI: InChI=1S/C5H9NO4/c1-3(7)10-2-4(6)5(8)9/h4,8H,2,6H2,1H3
charge 0 multiplicity 1
19 atoms
O  -1.070894 -0.097566 0.36605
O  2.236672 -1.675623 0.721334
O  1.641248 -0.925872 -1.398653
O  -2.730402 1.083954 -0.762282
N  2.227988 1.623214 0.358154
C  1.251225 0.541286 0.571782
C  -0.120306 1.007103 0.069565
C  1.682655 -0.740994 -0.16163
C  -2.370469 0.062693 -0.137018
C  -3.212742 -1.15677 0.164027
H  1.192587 0.322022 1.649629
H  -0.427637 1.921717 0.602402
H  -0.116267 1.19974 -1.018682
H  2.42272 1.832006 -0.626012
H  3.070946 1.564251 0.933918
H  -2.898466 -1.632385 1.105692
H  -3.087571 -1.894869 -0.649488
H  -4.27455 -0.871189 0.209086
H  2.557165 -2.469021 0.210427
