program: Gaussian 09
title: 000082131
version: EM64L-G09RevD.01
frameworkgroup: C1[X(C8H7BrO2)]
method: RPBEPBE
basis: SDD
operation: Freq
keyword: #p
keyword: freq=noraman
keyword: PBEPBE/SDD
title: #p freq=noraman PBEPBE/SDD
converged: YES YES YES YES
title: Mulliken charges:
elementType: Br O O C C C C C C C C H H H H H H H
charge: 0.019119 -0.440232 -0.249437 0.541756 0.271261 -0.530680 -0.358428 -0.334877 -0.165853 -0.811002 0.111366 0.280110 0.282005 0.255739 0.253922 0.253921 0.234907 0.386403
chargesum: 0.00000
title: Mulliken charges with hydrogens summed into heavy atoms:
elementType: Br O O C C C C C C C C
charge: 0.019119 -0.053828 -0.249437 0.541756 0.271261 -0.250570 -0.358428 -0.052872 0.089887 -0.068253 0.111366
polarizability: 1.78744454e+02 -3.19919370e-01 1.08872950e+02 -1.38060198e-03 6.24572903e-05 4.53509523e+01
1716.lowfreq: -5.8978 -0.3791 0.0005 0.0008 0.0009 6.3095 63.7572 74.3665 136.2813
frequency: 63.7565 74.3639 136.2775 146.8103 188.4584 212.0597 236.3950 268.0610 348.0880 437.3504 447.9513 507.6757 507.6834 540.9404 604.2818 612.2530 693.5540 703.6537 745.1531 842.9572 882.7247 932.7417 980.0546 990.5745 1008.0890 1047.9152 1051.5773 1139.1623 1146.4729 1215.7691 1263.6702 1324.9670 1374.4025 1401.7501 1404.3755 1450.0980 1463.0692 1478.4614 1572.7497 1603.4117 1643.1176 2986.1723 3064.4848 3100.2762 3149.2735 3164.5274 3187.1576 3531.9698
redmass: 9.0184 6.9299 1.0525 8.7451 3.1729 4.2838 14.2420 4.9358 4.3584 2.9730 5.8617 4.7543 2.9560 5.6632 1.3263 4.8152 4.1872 5.8647 3.4968 1.4136 5.3264 1.4170 1.3665 1.7250 5.4030 2.4445 1.5420 1.4111 1.5979 2.4362 1.3675 2.3380 7.3800 3.5065 1.2706 2.3216 1.0441 1.2439 7.4165 6.3460 8.7817 1.0374 1.0971 1.0995 1.0920 1.0895 1.0969 1.0642
irintensity: 1.7012 0.0232 0.6405 0.9600 2.6148 2.0787 0.1114 1.0961 6.4019 10.8980 31.1258 9.2005 25.3876 5.4889 101.4571 16.8635 38.1731 23.8947 32.3006 23.1083 20.0429 11.6160 1.4188 35.7199 184.8650 194.6973 12.1512 55.2729 42.2649 4.9656 9.1764 91.5072 12.7208 52.5773 3.1916 34.2011 14.1815 35.2175 12.3047 94.7381 281.5269 14.9845 11.6339 15.4631 1.5745 1.5570 1.1963 51.5921
temp: 298.150 k
press: 1.00000 atm
elementType: 35 8 8 6 6 6 6 6 6 6 6 1 1 1 1 1 1 1
symmnumber: 1
zpe: 340198.5 jmol-1
zpe.correction: 0.129575 hartree
zpe.thermalcorrener: 0.140050 hartree
zpe.thermalcorrenthalpy: 0.140994 hartree
zpe.thermalcorrgfe: 0.092124 hartree
zpe.sumelectzpe: -472.184020 hartree
zpe.sumelectthermal: -472.173544 hartree
zpe.sumelectthermalent: -472.172600 hartree
zpe.sumelectthermalfe: -472.221470 hartree
dipole: 0.1231 -0.7602 0.0000
dipole: 0.7701
quadrupole: -72.2598 -68.5586 -75.4218
quadrupole: 9.3699 0.0002 -0.0001
quadrupole: -0.1797 3.5214 -3.3417 9.3699 0.0002 -0.0001
hfenergy: -472.3135945 hartree
pointgroup: C01 [X(C8H7Br1O2)]
dipole: 0.0226183 -0.3021316 -0.0000027 debye
dipolederiv: -0.7849528 0.1255969 0.0000217 0.1314581 -0.0754244 -0.0000029 -0.0000377 0.0000118 -0.0293718 -0.9185289 -0.4821132 -0.0000272 -0.6596557 -0.8276829 -0.0000018 -0.0000425 -0.0000153 -0.4278396 -0.9850526 0.2912993 -0.0000218 0.2857053 -0.8744081 -0.0000017 0.0000384 -0.0000213 -0.3309479 -0.3212586 0.4525259 -0.0000125 0.3461307 0.0942091 0.0000025 -0.0000063 0.0000102 0.0264206 -0.8147097 0.0748525 0.0000329 0.091785 -0.0265645 0.0000243 -0.0000273 0.0000081 0.0203666 0.1743629 -0.247039 -0.0000315 0.200626 -0.0602629 -0.0000019 -0.0000468 0.00002 -0.1276847 1.3466872 -0.266954 -0.0000056 -0.2742956 0.0910485 0.0000041 0.0000629 -0.0000222 -0.1442552 0.1901195 0.0780728 -0.0000306 -0.2492946 -0.0117442 -0.0000034 -0.0000458 0.0000164 -0.1219421 -0.5306751 -0.0995486 -0.0000024 -0.0722768 0.023972 -0.0000044 -0.0000197 0.0000062 -0.0899455 -0.0655003 -0.1601683 -0.000009 -0.1218884 -0.0115502 -0.0000183 -0.0000255 -0.0000037 0.0470425 2.1879122 0.0156695 0.000049 0.1039922 1.3532205 -0.0000023 0.0000238 0.0000285 0.2314648 0.0921105 0.0475011 0.00001 0.0203176 -0.0008601 -0.0000144 0.0000501 -0.0000193 0.1534379 0.0648121 -0.0547112 0.0000124 -0.0481817 0.0360666 0.0000069 0.0000343 -0.0000112 0.166553 0.0628748 0.0582204 0. 0.0536936 -0.0244382 0.0000014 0.0000045 -0.0000001 0.1580794 0.0260968 -0.0422306 -0.0940985 -0.0176929 0.0573977 0.0274015 -0.1018555 -0.0178864 -0.0231717 0.0260625 -0.0422127 0.0941125 -0.0176877 0.0574033 -0.0274043 0.1018593 0.0178801 -0.0231516 0.0197605 0.1592607 -0.0000134 0.0474155 -0.0624859 0.0000108 0.0000042 0.0000093 0.1123453 0.229879 0.0919785 0.0000139 0.1798496 0.2621037 0.0000038 0.0000298 -0.0000108 0.4025998 unknown
polarizability: 178.1767717|-6.2805165|109.4406325|-0.0013702|0.0001805|45.3509523 unknown
InChI: InChI=1S/C8H7BrO2/c1-5-4-6(8(10)11)2-3-7(5)9/h2-4,10H,1H3
charge 0 multiplicity 1
18 atoms
Br 3.749487 -0.780893 -0.00003
O  -3.181298 -1.046445 -0.000081
O  -2.983822 1.267474 -0.000033
C  1.310844 0.862218 -0.00004
C  -0.966221 -0.111817 -0.000032
C  -0.097154 1.007683 -0.000041
C  1.808728 -0.469449 -0.000029
C  -0.430567 -1.4236 -0.000018
C  0.966464 -1.601722 -0.000015
C  2.214214 2.076676 -0.000048
C  -2.430705 0.140587 -0.000038
H  -0.540024 2.009683 -0.000047
H  -1.103244 -2.284853 -0.000006
H  1.397959 -2.606224 -0.000004
H  2.874721 2.08453 0.886482
H  2.874795 2.084468 -0.886523
H  1.622177 3.006266 -0.000105
H  -4.147954 -0.81238 -0.000092
