program: Gaussian 09
title: 000082119
version: EM64L-G09RevD.01
frameworkgroup: C1[X(C8H2Br3F3N2)]
method: RPBEPBE
basis: SDD
operation: Freq
keyword: #p
keyword: freq=noraman
keyword: PBEPBE/SDD
title: #p freq=noraman PBEPBE/SDD
converged: NO NO NO NO
title: Mulliken charges:
elementType: Br Br Br F F F N N C C C C C C C C H H
charge: 0.112563 0.086427 0.116330 -0.111605 -0.155119 -0.155211 -0.423803 0.006934 0.348963 0.188197 0.122922 -0.327322 -0.338382 0.256655 -0.159276 -0.188544 0.344722 0.275550
chargesum: 0.00000
title: Mulliken charges with hydrogens summed into heavy atoms:
elementType: Br Br Br F F F N N C C C C C C C C
charge: 0.112563 0.086427 0.116330 -0.111605 -0.155119 -0.155211 -0.079082 0.006934 0.348963 0.188197 0.122922 -0.051772 -0.338382 0.256655 -0.159276 -0.188544
polarizability: 2.35480330e+02 1.89352050e+00 1.75851547e+02 1.12370926e-03 4.38998530e-05 6.12084626e+01
1716.lowfreq: -26.7740 -0.0009 -0.0007 -0.0005 2.2573 4.1035 5.0907 39.7719 56.6833
frequency: -26.7362 39.7672 56.6786 83.8001 123.5720 125.9127 137.2554 160.3820 193.5581 207.9058 215.1912 278.1355 320.0124 332.1927 382.0066 384.0177 398.5248 487.0309 489.3850 532.6365 574.2175 617.9279 634.2559 647.1594 679.0670 702.6989 711.3250 777.3409 856.7860 864.7805 910.0128 938.5832 970.7939 1039.9482 1097.7873 1116.2909 1193.9388 1228.7443 1285.1873 1334.8290 1361.5115 1382.9452 1416.8199 1515.6436 1553.6798 1616.3361 3180.4309 3583.1171
redmass: 17.9203 42.7821 13.3806 23.2147 8.2234 42.3928 68.6948 9.9749 16.8926 28.7220 47.6161 10.5860 5.7715 14.2602 10.3049 12.8470 14.0287 10.7525 12.6925 4.8930 7.0874 1.2757 14.9208 7.0388 10.7757 10.6888 8.8933 5.9425 1.5494 8.4287 11.9140 8.6625 12.1869 10.2292 5.7680 2.4392 9.3964 1.9657 3.9822 3.6609 6.8673 7.5632 5.3018 4.9129 11.0585 8.2363 1.0938 1.0822
irintensity: 0.5306 0.0818 1.4058 0.4716 4.7298 0.5740 0.0135 9.1630 4.5113 0.1626 0.0766 0.1069 0.0627 1.6622 12.0224 0.1923 11.8024 6.4552 1.5923 4.2503 6.9730 72.2803 3.0501 9.6105 20.5466 0.9655 29.3288 4.3705 30.7367 21.2026 29.5162 39.0186 274.8590 255.3569 197.7903 34.3558 30.4388 218.3890 159.7313 44.6987 69.8650 57.7245 3.3047 47.7847 98.1556 31.7117 0.0399 102.8977
temp: 298.150 k
press: 1.00000 atm
elementType: 35 35 35 9 9 9 7 7 6 6 6 6 6 6 6 6 1 1
symmnumber: 1
zpe: 231717.4 jmol-1
zpe.correction: 0.088256 hartree
zpe.thermalcorrener: 0.102176 hartree
zpe.thermalcorrenthalpy: 0.103120 hartree
zpe.thermalcorrgfe: 0.044316 hartree
zpe.sumelectzpe: -754.318313 hartree
zpe.sumelectthermal: -754.304393 hartree
zpe.sumelectthermalent: -754.303449 hartree
zpe.sumelectthermalfe: -754.362253 hartree
dipole: -0.9817 -4.1514 0.0001
dipole: 4.2659
quadrupole: -131.2876 -106.4440 -120.3123
quadrupole: -8.9793 0.0000 -0.0007
quadrupole: -11.9396 12.9039 -0.9643 -8.9793 0.0000 -0.0007
hfenergy: -754.406569 hartree
pointgroup: C01[X(C8H2Br3F3N2)]
dipole: -0.3262768 1.6463159 -0.0004064 debye
dipolederiv: 0.0765468 0.0397148 0.0000032 -0.0266268 -0.5967432 0.000067 0.0000099 0.0000623 0.0523067 -0.4250215 0.2914435 -0.0002307 0.3768023 -0.2342431 0.0001975 -0.0002565 0.0001778 0.0214854 -0.4474937 -0.2117208 -0.0001511 -0.2731414 -0.0277766 -0.0000882 -0.0001524 -0.0000667 0.0467392 -0.5813378 0.2057221 -0.00048 0.2501636 -0.6317505 0.0007942 -0.0002878 0.0007394 -0.2552566 -0.7945325 -0.1129452 0.1754254 -0.2527328 -0.39497 0.2158116 0.2705926 0.1878061 -0.6303255 -0.7935204 -0.1132642 -0.1752588 -0.2532461 -0.396172 -0.2166373 -0.2695506 -0.1884461 -0.6294101 -0.4921894 0.0242395 -0.0001217 -0.2761038 -0.5349675 -0.0000455 0.0000612 0.0001843 -0.2238083 -0.1563955 -0.1783709 0.0000379 0.0372929 -0.3256861 0.0000692 -0.0001396 -0.0001461 -0.2027767 0.4048431 0.0945839 0.0000881 0.1474033 0.0733753 0.0000458 0.000122 0.0000332 0.0871627 0.0675078 0.0503375 -0.0000366 -0.03649 -0.3794131 0.0000349 0.000065 0.0000842 0.0671992 -0.7099314 -0.0965515 -0.0001688 0.0462382 0.6405158 -0.0001283 -0.0008576 -0.0001875 -0.0587002 -0.2697694 0.0423581 -0.0000686 0.0372773 -0.1628914 0.000012 -0.0000841 0.0000126 -0.1167965 0.016292 -0.1309784 0.0000783 -0.0664338 1.1406461 -0.0001363 0.0000683 -0.0001383 -0.0878075 2.6899371 0.0554605 0.0004917 0.1106827 1.3828198 -0.0000008 0.000034 -0.0000123 1.5645699 0.5518372 -0.6387864 0.0003906 -0.6711808 0.5799938 -0.0003971 0.0004078 -0.0003886 -0.0965108 0.5589626 0.655994 0.0001086 0.7784783 -0.3686873 0.000323 0.0001102 0.0002633 -0.076304 0.2399373 0.0422923 -0.0000635 0.0712132 0.2404121 0.0000375 -0.0000812 -0.00001 0.3536485 0.0643274 -0.0195289 -0.0000439 0.0004036 -0.0044622 0.0000409 -0.0000613 0.0000324 0.1845844 unknown
polarizability: 235.2622445|-4.0669745|176.0696012|0.0701275|-0.0192246|61.2084935 unknown
InChI: InChI=1S/C8H2Br3F3N2/c9-2-1-3-6(5(11)4(2)10)16-7(15-3)8(12,13)14/h1,15H
charge 0 multiplicity 1
18 atoms
Br -1.508672 -3.099771 -0.00033
Br -4.228704 2.142163 -0.002188
Br -4.431842 -1.272857 -0.001586
F  3.863744 -1.249897 0.003547
F  3.848586 0.723738 -1.130839
F  3.847946 0.727213 1.131802
N  1.129731 1.260802 0.000083
N  1.03613 -1.02897 0.000361
C  -0.229629 0.937377 -0.000353
C  -0.266729 -0.499564 -0.000155
C  1.830284 0.049068 0.000651
C  -1.391961 1.728172 -0.00098
C  -1.516894 -1.168751 -0.00051
C  3.326073 0.033785 0.001304
C  -2.619074 1.04089 -0.001307
C  -2.700273 -0.3927 -0.001062
H  1.538077 2.195585 0.000182
H  -1.367292 2.820019 -0.00122
