program: Gaussian 09
title: 000082076
version: EM64L-G09RevD.01
frameworkgroup: C1[X(C9H12)]
method: RPBEPBE
basis: SDD
operation: Freq
keyword: #p
keyword: freq=noraman
keyword: PBEPBE/SDD
title: #p freq=noraman PBEPBE/SDD
converged: YES YES NO NO
title: Mulliken charges:
elementType: C C C C C C C C C H H H H H H H H H H H H
charge: 0.217940 0.217942 -0.537578 -0.537583 -0.450456 -0.540817 -0.540819 -0.199384 -0.199381 0.215725 0.214303 0.214304 0.215725 0.212888 0.221853 0.214364 0.216068 0.216068 0.214364 0.207238 0.207237
chargesum: 0.00000
title: Mulliken charges with hydrogens summed into heavy atoms:
elementType: C C C C C C C C C
charge: 0.217940 0.217942 -0.107550 -0.107554 -0.015715 -0.110385 -0.110387 0.007854 0.007856
polarizability: 9.54915212e+01 5.77816028e-05 1.08256494e+02 5.61220179e-01 -2.51645665e-05 5.92603893e+01
1716.lowfreq: -19.8455 -0.0009 -0.0007 -0.0005 9.2497 13.9014 90.6206 127.2955 175.1972
frequency: 90.6188 127.2835 175.1820 256.0402 334.1969 392.0626 455.5248 473.9898 552.6859 612.2653 668.5927 709.7186 807.4074 827.2567 882.0436 899.6950 913.8944 925.0176 953.3779 960.7469 984.9525 1022.9467 1042.5534 1080.5123 1121.2411 1151.9360 1164.5733 1170.4959 1180.3157 1183.1652 1208.4060 1224.4303 1281.4061 1292.3180 1305.9472 1348.1498 1374.5114 1384.9622 1449.5957 1454.0963 1460.7843 1466.9015 1480.7421 1672.1476 1719.8405 2923.5795 2924.0731 2947.1651 2947.5200 2952.2446 2952.9768 2997.1003 3004.9034 3017.7812 3072.9039 3091.8086 3124.9989
redmass: 2.3216 1.6580 2.1940 2.1776 3.3677 2.0896 5.1445 2.4971 5.8429 2.7076 1.1608 2.0586 4.8016 2.1425 1.4086 3.1065 2.1240 1.7482 1.4546 2.3746 1.4972 2.4248 1.6855 3.0822 1.1863 1.9149 1.4851 1.1992 1.1203 1.1786 1.2040 1.4409 1.3248 1.8093 1.4326 2.1048 1.5128 3.4377 1.1102 1.0761 1.0860 1.0806 1.1012 6.6679 7.3158 1.0591 1.0599 1.0965 1.0966 1.0632 1.0638 1.0846 1.0971 1.0737 1.1044 1.0837 1.0992
irintensity: 0.0878 0.0743 0.0007 14.6609 0.6838 0.0002 0.1496 0.1489 0.5446 0.0356 50.1698 7.3344 1.2741 5.3172 0.0419 2.2039 1.4213 3.2304 0.1004 9.1530 0.0755 3.6695 2.0375 0.0455 0.7776 0.1831 0.7115 0.8607 0.0920 0.3059 1.2129 0.4136 0.8666 3.6800 4.6285 5.1028 0.1083 0.0139 0.1339 8.5120 2.8123 10.3822 5.5644 7.0116 0.4252 1.9295 104.3567 51.6101 1.7761 105.9815 31.3944 18.2716 23.2641 76.3859 55.5201 9.5936 70.8092
temp: 298.150 k
press: 1.00000 atm
elementType: 6 6 6 6 6 6 6 6 6 1 1 1 1 1 1 1 1 1 1 1 1
symmnumber: 1
zpe: 479712.0 jmol-1
zpe.correction: 0.182713 hartree
zpe.thermalcorrener: 0.190655 hartree
zpe.thermalcorrenthalpy: 0.191599 hartree
zpe.thermalcorrgfe: 0.150225 hartree
zpe.sumelectzpe: -349.451699 hartree
zpe.sumelectthermal: -349.443756 hartree
zpe.sumelectthermalent: -349.442812 hartree
zpe.sumelectthermalfe: -349.484186 hartree
dipole: 0.2138 0.0000 0.0768
dipole: 0.2272
quadrupole: -53.1337 -50.9295 -56.1737
quadrupole: 0.0001 0.1606 0.0000
quadrupole: 0.2787 2.4828 -2.7614 0.0001 0.1606 0.0000
hfenergy: -349.6344115 hartree
pointgroup: C01 [X(C9H12)]
dipole: -0.0841847 0.0000007 -0.0300395 debye
dipolederiv: 0.1217493 0.006493 0.0066263 -0.0084266 0.0496517 0.0044955 0.0269122 0.0469447 -0.1642671 0.1217481 -0.0064912 0.0066317 0.0084291 0.049651 -0.0044896 0.0269177 -0.0469374 -0.1642672 -0.0730891 0.0611662 0.0043375 0.0317503 0.0649045 -0.0191034 0.0012351 -0.0315136 0.2132655 -0.0730827 -0.0611747 0.0043344 -0.0317561 0.0649012 0.0191021 0.0012304 0.0315143 0.2132662 0.0722279 -0.0000026 0.048012 -0.0000058 -0.0264605 -0.0000006 -0.014546 -0.0000019 0.1529998 -0.0972057 -0.0502987 -0.0029785 -0.059532 0.0179935 -0.000467 -0.0056255 -0.0041112 0.2807185 -0.097203 0.0503 -0.0029786 0.0595326 0.0179915 0.0004563 -0.0056255 0.0040949 0.2807183 0.1601002 0.0777123 0.0088019 0.1089972 0.0580736 0.0026165 0.0080073 0.00057 -0.2403134 0.1600996 -0.0777134 0.0087972 -0.1089963 0.0580773 -0.0026067 0.0080025 -0.0005571 -0.2403128 0.0103132 -0.0493526 -0.0192697 -0.0181407 -0.0105166 -0.0878438 -0.0629723 -0.1510609 -0.1272937 0.0382797 -0.0338329 0.0102391 -0.0462151 -0.1106172 0.1058442 0.0529359 0.1542495 -0.0182636 0.0382776 0.0338387 0.0102418 0.0462165 -0.1106115 -0.1058449 0.052938 -0.1542511 -0.0182665 0.0103118 0.0493557 -0.01927 0.0181423 -0.0105191 0.087843 -0.0629713 0.1510615 -0.1272908 -0.170812 0.0000024 -0.0969575 0.0000054 0.0655975 0.0000014 -0.1420951 0.0000011 0.0166486 0.0418838 0. 0.0508406 0.0000008 0.0453147 0. 0.1249255 0.0000007 -0.1535135 0.0197302 -0.0112045 -0.0134832 0.0177439 -0.0624861 -0.1085558 0.0157598 -0.1810006 -0.0557584 0.0181483 -0.0167682 0.0107827 0.0158511 -0.0652493 0.1102017 -0.0136465 0.1774059 -0.052325 0.0181476 0.016767 0.0107825 -0.015851 -0.0652381 -0.1102018 -0.0136485 -0.1774055 -0.0523372 0.01973 0.0112027 -0.0134806 -0.0177458 -0.0624966 0.1085566 0.0157617 0.1810011 -0.0557461 -0.1696761 0.0871022 -0.0060037 0.094237 0.0160188 0.0018296 -0.0067466 0.0016143 0.1561696 -0.1696788 -0.0871014 -0.006006 -0.0942368 0.0160196 -0.0018337 -0.0067487 -0.0016187 0.1561689 unknown
polarizability: 95.4935309|-0.0000064|108.2564935|0.4920859|0.000694|59.2583795 unknown
InChI: InChI=1S/C9H12/c1-2-5-9-7-3-6-8(9)4-1/h1-2H,3-7H2
charge 0 multiplicity 1
21 atoms
C  -0.261842 -0.68031 -0.012499
C  -0.261841 0.680278 -0.012482
C  -1.674156 -1.245656 -0.089874
C  -1.674148 1.245633 -0.089853
C  -2.579167 -0.000015 0.185219
C  0.988752 -1.526762 0.003415
C  0.988764 1.526716 0.003466
C  2.250427 -0.679288 0.027067
C  2.25043 0.679229 0.027087
H  -1.866905 -1.679956 -1.094052
H  -1.849913 -2.060117 0.640577
H  -1.84992 2.060082 0.640607
H  -1.866898 1.679939 -1.094028
H  -3.496185 0.000001 -0.429937
H  -2.889752 -0.000018 1.24596
H  1.00759 -2.204489 -0.879722
H  0.980021 -2.212845 0.88003
H  0.980036 2.21276 0.880113
H  1.007612 2.204483 -0.879639
H  3.208294 -1.217939 0.045356
H  3.208301 1.217873 0.04539
