program: Gaussian 09
title: 000082062
version: EM64L-G09RevD.01
frameworkgroup: C1[X(C4H2O6)]
method: RPBEPBE
basis: SDD
operation: Freq
keyword: #p
keyword: freq=noraman
keyword: PBEPBE/SDD
title: #p freq=noraman PBEPBE/SDD
converged: YES YES NO NO
title: Mulliken charges:
elementType: O O O O O O C C C C H H
charge: -0.360878 -0.360937 -0.092752 -0.093006 -0.199116 -0.199097 0.077441 0.078091 0.175660 0.175799 0.399406 0.399391
chargesum: 0.00000
title: Mulliken charges with hydrogens summed into heavy atoms:
elementType: O O O O O O C C C C
charge: 0.038527 0.038453 -0.092752 -0.093006 -0.199116 -0.199097 0.077441 0.078091 0.175660 0.175799
polarizability: 7.75099351e+01 3.38236621e-02 6.10756270e+01 1.03395622e+01 -3.44867660e-03 4.59737464e+01
1716.lowfreq: -4.7582 -0.0001 0.0007 0.0008 5.7418 9.7975 33.2290 50.8534 84.1936
frequency: 33.2288 50.8369 84.1936 126.7919 153.1403 274.7537 285.1919 337.5442 379.5828 392.7905 501.4800 513.6271 607.3236 629.9405 633.0682 677.8082 724.8816 792.1487 907.0965 1014.3001 1073.4765 1123.8508 1330.1634 1337.4956 1602.9260 1605.6054 1645.1184 1648.0974 3505.0422 3505.8190
redmass: 9.9397 10.2433 11.6401 12.8077 12.5303 9.9502 8.3073 12.3796 5.4084 5.1618 7.8796 4.0464 2.3226 1.8520 1.5279 4.4217 10.6006 12.2881 12.7602 5.4481 2.0677 2.5147 2.8766 3.1735 11.2920 11.0028 12.8408 13.0182 1.0646 1.0646
irintensity: 1.8776 5.4914 1.3762 0.1008 1.4635 7.2008 5.9437 0.7837 13.7859 1.1211 51.9777 40.6420 257.6221 125.6304 82.7101 24.7490 13.4922 0.7234 163.9081 37.8053 309.1785 2.6683 37.6639 9.0187 429.4888 7.7626 40.5401 78.8396 84.2440 34.8250
temp: 298.150 k
press: 1.00000 atm
elementType: 8 8 8 8 8 8 6 6 6 6 1 1
symmnumber: 1
zpe: 164470.5 jmol-1
zpe.correction: 0.062644 hartree
zpe.thermalcorrener: 0.072535 hartree
zpe.thermalcorrenthalpy: 0.073480 hartree
zpe.thermalcorrgfe: 0.025809 hartree
zpe.sumelectzpe: -604.187001 hartree
zpe.sumelectthermal: -604.177109 hartree
zpe.sumelectthermalent: -604.176165 hartree
zpe.sumelectthermalfe: -604.223835 hartree
dipole: -0.0022 -3.4154 -0.0003
dipole: 3.4154
quadrupole: -42.5097 -58.3146 -61.1507
quadrupole: -0.0238 -6.8698 0.0259
quadrupole: 11.4819 -4.3229 -7.1590 -0.0238 -6.8698 0.0259
hfenergy: -604.2496444 hartree
pointgroup: C01 [X(C4H2O6)]
dipole: 0.0001855 -1.3437138 0.0001457 debye
dipolederiv: -1.1762644 0.1099987 -0.3273159 0.2165877 -0.2929112 0.1796495 -0.3416924 0.1510153 -0.4301045 -1.1796291 -0.1105542 -0.3261446 -0.2152459 -0.2923762 -0.1785891 -0.3376683 -0.1502456 -0.4278546 -0.5449723 -0.0670173 -0.0637381 -0.1389338 -0.5386918 -0.1788699 -0.1029124 -0.1458655 -0.3198303 -0.5458667 0.0674115 -0.0644763 0.1393339 -0.5394324 0.1796193 -0.1024731 0.144506 -0.3193546 -0.7400237 0.1637735 -0.074193 -0.0479399 -0.4841669 -0.2629579 -0.290958 -0.059062 -0.5699467 -0.7413654 -0.1637506 -0.0734157 0.0486808 -0.4844035 0.2616796 -0.291344 0.0606457 -0.5682644 0.7084943 -0.036908 0.0361822 0.0400938 0.667241 0.2615448 -0.0000427 0.1531176 0.3063014 0.7092404 0.0367985 0.0368429 -0.0410837 0.6685052 -0.261601 0.0003174 -0.1522273 0.3052426 1.3463733 -0.1856083 0.429878 -0.0924455 0.4224048 0.159971 0.7282878 -0.0145706 0.7176067 1.3520389 0.1856104 0.4277337 0.0905731 0.4214192 -0.1604982 0.7249446 0.0123872 0.7140688 0.4061515 0.0148387 -0.0006251 0.0384467 0.2260949 -0.1291705 0.0068034 -0.1364528 0.2960688 0.4058231 -0.014593 -0.0007279 -0.0380671 0.2263168 0.1292223 0.0067377 0.1367519 0.2960669 unknown
polarizability: 76.3056289|-0.0416532|61.0756641|11.9764064|-0.0039689|47.1780155 unknown
InChI: InChI=1S/C4H2O6/c5-1(3(7)8)2(6)4(9)10/h7,9H
charge 0 multiplicity 1
12 atoms
O  2.738013 -0.577367 0.344832
O  -2.739448 -0.576466 -0.342041
O  1.223901 1.750617 0.895798
O  -1.226431 1.751608 -0.894477
O  1.059201 -1.128131 -1.185592
O  -1.05589 -1.129346 1.182365
C  0.740413 0.807477 0.244314
C  -0.74024 0.806426 -0.247991
C  1.524372 -0.404956 -0.272029
C  -1.522368 -0.406976 0.268828
H  3.213879 -1.372501 -0.021974
H  -3.215303 -1.370586 0.026969
