program: Gaussian 09
title: 000082075
version: EM64L-G09RevD.01
frameworkgroup: C1[X(C8H6Cl2O4)]
method: RPBEPBE
basis: SDD
operation: Freq
keyword: #p
keyword: freq=noraman
keyword: PBEPBE/SDD
title: #p freq=noraman PBEPBE/SDD
converged: YES YES NO NO
title: Mulliken charges:
elementType: Cl Cl O O O O C C C C C C C C H H H H H H
charge: 0.030036 -0.014940 -0.271142 -0.403568 -0.381948 -0.227275 0.421075 0.282206 -0.529894 -0.263318 0.442500 -0.401502 0.099753 -0.516731 0.256210 0.237783 0.259096 0.224978 0.368589 0.388092
chargesum: 0.00000
title: Mulliken charges with hydrogens summed into heavy atoms:
elementType: Cl Cl O O O O C C C C C C C C
charge: 0.030036 -0.014940 -0.271142 -0.034979 0.006144 -0.227275 0.421075 0.282206 -0.529894 -0.263318 0.442500 -0.145293 0.099753 0.205127
polarizability: 1.63088178e+02 2.34060268e+00 1.40327110e+02 -9.09719053e-01 -9.27211734e-01 6.08870980e+01
1716.lowfreq: -6.7311 -1.7331 -0.0030 -0.0021 0.0007 8.4646 53.4397 65.1811 78.9621
frequency: 53.4325 65.1807 78.9616 117.3249 126.5054 143.8941 152.6063 189.0810 211.8126 229.0367 247.9471 289.0177 312.0032 323.4096 332.6361 366.4593 419.5511 468.2845 502.2858 538.9280 592.6623 600.3387 635.5827 658.8808 694.4286 772.5073 779.2614 826.4326 835.1241 929.7397 970.5544 1041.6355 1111.3070 1122.3329 1150.8328 1153.4652 1205.5487 1272.4026 1311.5077 1356.7593 1396.3839 1429.3693 1457.3553 1460.9035 1471.7686 1556.9857 1604.3043 1643.4230 2983.8050 3088.9822 3133.9936 3146.9372 3505.4479 3585.5949
redmass: 8.9623 6.5390 9.7289 3.1647 6.0171 8.7954 1.0673 16.3181 6.4375 8.6713 5.2650 7.9100 17.9850 1.1418 9.6993 8.7033 6.6196 6.0214 3.5346 7.4569 4.5550 1.7233 4.5689 6.4099 4.3806 8.6130 7.0119 1.6354 8.8943 10.4851 10.4042 3.6504 1.2725 2.1083 1.3756 1.4681 1.8462 3.1255 4.4679 7.5256 3.8235 1.8192 2.2933 1.0682 1.0556 8.1583 8.2132 9.6462 1.0297 1.1057 1.1030 1.0925 1.0639 1.0663
irintensity: 0.7223 2.2386 1.5532 9.2064 3.5403 0.3212 0.1449 0.7557 3.2590 7.4191 5.9836 4.7697 2.5781 131.4858 2.1702 1.8533 8.6684 1.1589 2.8846 46.5178 46.6353 94.9223 25.9255 12.1480 51.5917 50.2633 0.6550 31.4127 9.8786 111.9697 47.3817 151.4899 14.8357 158.9354 131.2424 94.3499 82.5390 19.8331 122.8084 16.1492 75.9793 17.8276 112.1430 19.2871 10.5601 17.7714 37.6056 226.6838 51.8090 16.5573 19.3933 2.1560 38.3225 58.5585
temp: 298.150 k
press: 1.00000 atm
elementType: 17 17 8 8 8 8 6 6 6 6 6 6 6 6 1 1 1 1 1 1
symmnumber: 1
zpe: 332890.3 jmol-1
zpe.correction: 0.126791 hartree
zpe.thermalcorrener: 0.141071 hartree
zpe.thermalcorrenthalpy: 0.142015 hartree
zpe.thermalcorrgfe: 0.084995 hartree
zpe.sumelectzpe: -1528.407154 hartree
zpe.sumelectthermal: -1528.392874 hartree
zpe.sumelectthermalent: -1528.391930 hartree
zpe.sumelectthermalfe: -1528.448950 hartree
dipole: 1.1061 -1.8390 -0.6484
dipole: 2.2418
quadrupole: -96.1525 -75.4771 -97.4153
quadrupole: -4.1996 -5.6102 2.9783
quadrupole: -6.4709 14.2046 -7.7336 -4.1996 -5.6102 2.9783
hfenergy: -1528.5339451 hartree
pointgroup: C01 [X(C8H6Cl2O4)]
dipole: 0.5461749 0.6331304 -0.2806403 debye
dipolederiv: -0.118844 0.1597667 -0.0137756 0.2570075 -0.6572652 0.0313275 -0.0196761 0.0056104 -0.0047946 -0.1289997 0.1239838 -0.0075118 0.1317487 -0.7317147 0.0129498 -0.0162676 0.0271355 -0.0415048 -1.2115714 0.2897725 -0.2908213 0.2974852 -0.4835898 0.0955815 -0.1665459 0.0699895 -0.3997872 -1.4475064 0.2461824 -0.0316735 0.2896421 -0.0853717 -0.0164161 -0.0032362 -0.0215183 -0.3941199 -0.3470493 -0.0638648 0.1466562 -0.0414915 -0.62562 0.4388224 0.146117 0.462989 -0.9410904 -0.7080628 -0.1929698 -0.3255384 -0.2505044 -0.532107 -0.0210897 -0.1226925 0.1288159 -0.7499791 -0.204133 -0.2833657 -0.0015362 0.0196875 -0.2348301 0.0547513 -0.0529712 0.0250893 -0.0210118 0.9220785 -0.2334015 0.1339004 -0.1600917 -0.0680092 -0.0183176 -0.1234437 0.0018647 -0.0414519 -0.0275593 0.0002738 -0.0358964 -0.5491597 0.9903816 -0.0489669 0.0588526 0.0048987 -0.100467 0.0655873 0.0127584 -0.0325838 -0.2949838 1.100578 -0.0246787 0.0421681 -0.0473232 -0.0447975 1.3540424 -0.1613806 0.0216096 -0.1827841 -0.1982984 0.0137526 0.003159 0.0185013 0.1165199 -0.2401267 -0.1089261 -0.0019222 0.2892441 -0.2065996 -0.0030217 -0.0210007 0.002412 -0.1430598 0.9770307 0.5060396 0.2651511 0.5564432 0.9833329 -0.4393579 0.0898924 -0.5220299 1.3726704 0.5045684 -0.0930733 0.1859634 -0.124398 0.3029437 -0.0849363 0.3757895 -0.1370226 0.4511037 -0.0141905 -0.050863 0.0026493 -0.0497223 0.0404524 0.0077085 0.0023931 0.0136844 0.1779405 -0.1227034 0.0783177 0.0109005 0.0749549 0.092555 0.0016638 0.0379473 -0.0121788 0.0624781 0.0760072 0.020172 -0.0084834 -0.0337859 -0.0071413 -0.1192353 -0.0844093 -0.0383763 -0.0012347 0.0348468 -0.0970046 0.0545228 -0.0238742 -0.0432846 0.1229052 -0.0375269 0.081741 -0.0148307 0.4280412 -0.057815 0.0062707 -0.1003829 0.0855336 0.0190619 0.0031778 0.0150289 0.3896923 0.2085439 -0.0946026 -0.0778813 -0.1050347 0.2780543 -0.0225043 -0.1117266 -0.0793114 0.3277245 unknown
polarizability: 143.952207|-8.3414992|157.7004854|7.9423104|-10.7012819|62.6496935 unknown
InChI: InChI=1S/C8H6Cl2O4/c1-14-7-3(9)2-4(11)6(10)5(7)8(12)13/h2,11-12H,1H3
charge 0 multiplicity 1
20 atoms
Cl 1.592995 -2.63301 0.188369
Cl -0.0904 3.559233 -0.10398
O  -2.01388 1.167551 0.146092
O  3.423538 -0.329371 0.065697
O  -1.392236 -2.285098 1.334928
O  -2.221377 -1.740673 -0.763487
C  -0.278949 -0.542125 0.118165
C  -0.660982 0.828161 0.032627
C  1.084995 -0.900558 0.130401
C  0.358852 1.80404 -0.034297
C  2.093651 0.093062 0.056168
C  1.719909 1.454648 -0.024511
C  -1.384312 -1.56126 0.148352
C  -2.724645 1.442413 -1.131255
H  2.483297 2.238746 -0.074319
H  -3.737505 1.747187 -0.830321
H  -2.763237 0.519839 -1.736467
H  -2.230868 2.262465 -1.683633
H  4.044715 0.439184 0.01628
H  -2.125262 -2.959735 1.307389
