program: Gaussian 09
title: 000082097
version: EM64L-G09RevD.01
frameworkgroup: C1[X(C12H27O2P)]
method: RPBEPBE
basis: SDD
operation: Freq
keyword: #p
keyword: freq=noraman
keyword: PBEPBE/SDD
title: #p freq=noraman PBEPBE/SDD
converged: YES YES NO NO
title: Mulliken charges:
elementType: P O O C C C C C C C C C C C C H H H H H H H H H H H H H H H H H H H H H H H H H H H
charge: 1.125073 -0.694292 -0.661663 -0.753815 -0.743863 -0.320861 -0.336999 -0.351660 -0.349327 -0.353134 -0.353615 -0.355027 -0.354301 -0.694878 -0.694664 0.258722 0.259206 0.250843 0.275507 0.231793 0.219093 0.236623 0.201356 0.188000 0.187657 0.194207 0.189198 0.192695 0.189485 0.193749 0.186947 0.194841 0.194194 0.196566 0.194403 0.382725 0.210276 0.211264 0.215646 0.209566 0.211703 0.216759
chargesum: 0.00000
title: Mulliken charges with hydrogens summed into heavy atoms:
elementType: P O O C C C C C C C C C C C C
charge: 1.125073 -0.311567 -0.661663 -0.235887 -0.217514 0.130025 0.100981 0.023998 0.034078 0.029047 0.027081 0.034008 0.036669 -0.057691 -0.056636
polarizability: 2.03324224e+02 1.42489416e+00 1.49825846e+02 1.16690400e+00 6.68549220e-01 1.36912661e+02
1716.lowfreq: -9.0990 -6.5983 -0.0013 -0.0011 -0.0010 5.7967 18.0217 20.6283 32.4534
frequency: 17.8158 19.5710 32.2989 45.7091 48.3014 64.0105 68.1986 75.4319 107.1461 110.5328 120.5948 128.2123 135.9445 141.1356 153.9292 193.5625 209.6496 226.2992 237.0624 249.8324 266.9875 278.1533 312.7829 345.8766 413.1586 421.7605 432.3792 482.5002 635.1791 689.9313 722.1368 725.9013 727.1312 739.6806 748.6114 778.3295 783.2380 862.1532 862.4021 889.3560 890.3810 957.1096 963.9591 970.7221 1002.6532 1007.0533 1020.2356 1024.6105 1030.8477 1058.3164 1067.1290 1069.2357 1077.6852 1080.7212 1097.8253 1113.6561 1116.4224 1190.1166 1193.0236 1216.6911 1218.0107 1237.0564 1241.9837 1263.6629 1264.5267 1279.6526 1282.4159 1286.0080 1286.9302 1299.0105 1300.5968 1316.6704 1318.0774 1348.7299 1352.3397 1353.0525 1356.2335 1389.2859 1389.7077 1415.4562 1420.4457 1462.2023 1464.1211 1464.9180 1467.7478 1472.9070 1475.8707 1476.2427 1478.2162 1481.3393 1484.1027 1487.9932 1489.8498 2953.9303 2954.1813 2958.0739 2958.7891 2967.7430 2968.6606 2972.6376 2972.6962 2974.9528 2986.2168 2991.3130 2991.6438 3002.2190 3005.9621 3006.6449 3007.2725 3027.0133 3030.5745 3042.9423 3047.6207 3069.2789 3069.3866 3071.6083 3072.1773 3076.3032 3078.6129 3592.9302
redmass: 4.1116 2.8835 1.6011 1.9488 3.7794 3.6827 2.4019 3.1255 1.9252 1.8565 3.3533 2.5507 2.2874 2.2885 2.5962 3.0051 3.6576 1.1131 1.1101 3.5157 1.6992 3.0570 4.2724 4.5598 3.3385 2.9971 3.1609 4.3374 6.6045 3.7480 1.4495 1.1125 1.0702 1.1971 1.6422 1.2902 1.3878 1.2749 1.2863 1.9019 1.8943 1.7566 1.2443 1.3457 3.5782 3.5146 2.4630 3.4472 1.9840 1.2643 2.3694 2.5710 2.2472 2.2846 1.6488 2.3331 2.2627 1.6982 1.6563 1.2787 1.2817 1.3438 1.3364 1.3044 1.3009 1.1411 1.1312 1.0752 1.0819 1.0959 1.0977 1.3493 1.3484 1.4634 1.4644 1.6293 1.6446 1.2146 1.2172 1.0796 1.0821 1.0670 1.0750 1.0667 1.0730 1.0731 1.0566 1.0536 1.0425 1.0801 1.0793 1.0858 1.0912 1.0587 1.0590 1.0590 1.0588 1.0593 1.0592 1.0363 1.0365 1.0602 1.0590 1.0978 1.0973 1.0569 1.0733 1.1013 1.0847 1.1030 1.1038 1.1041 1.1037 1.1007 1.1007 1.0993 1.0993 1.1045 1.1040 1.0661
irintensity: 0.2255 1.0789 0.0433 0.2749 1.0223 0.8148 0.2877 0.4499 8.0867 0.7193 8.1921 27.5253 6.3638 17.3529 11.7788 8.4215 4.9482 0.1702 0.2046 5.8190 55.0212 3.0928 23.2718 34.1327 0.8753 0.1097 1.7618 29.5751 69.2177 71.0198 13.5721 12.3246 15.5959 15.4717 27.2410 17.7735 31.6300 1.0869 7.1785 5.7247 7.9528 9.1343 10.3523 4.7655 3.6219 2.0845 14.6147 7.1255 39.5251 4.6475 3.0422 1.7116 0.5506 1.3949 52.9749 34.4782 13.0547 0.8629 2.1961 10.7586 27.0966 0.7818 1.4049 0.5499 0.9562 0.1763 0.1037 0.6265 0.4901 0.6814 0.8960 0.3316 0.6356 0.4724 0.2325 0.8244 1.2787 11.1038 10.8784 5.6176 6.8744 0.1570 0.2137 0.1274 0.1717 2.1539 6.9354 7.9652 12.5736 3.5017 1.0462 22.7481 24.5713 2.6184 0.3031 6.8060 5.5587 57.0237 86.7647 54.0495 17.3969 65.6264 20.4065 1.5391 1.1750 26.4185 8.7951 0.9420 6.3539 11.0526 32.5138 63.1454 37.0409 76.6149 89.1345 54.3802 53.4867 26.7276 34.9767 47.6103
temp: 298.150 k
press: 1.00000 atm
elementType: 15 8 8 6 6 6 6 6 6 6 6 6 6 6 6 1 1 1 1 1 1 1 1 1 1 1 1 1 1 1 1 1 1 1 1 1 1 1 1 1 1 1
symmnumber: 1
zpe: 973927.9 jmol-1
zpe.correction: 0.370950 hartree
zpe.thermalcorrener: 0.392736 hartree
zpe.thermalcorrenthalpy: 0.393680 hartree
zpe.thermalcorrgfe: 0.316029 hartree
zpe.sumelectzpe: -963.883241 hartree
zpe.sumelectthermal: -963.861454 hartree
zpe.sumelectthermalent: -963.860510 hartree
zpe.sumelectthermalfe: -963.938161 hartree
dipole: -0.6812 -1.6202 -2.5098
dipole: 3.0641
quadrupole: -96.4746 -103.0818 -113.0792
quadrupole: -0.9932 0.8129 -2.2806
quadrupole: 7.7372 1.1301 -8.8673 -0.9932 0.8129 -2.2806
hfenergy: -964.2541901 hartree
pointgroup: C01 [X(C12H27O2P1)]
dipole: -0.2648273 0.6816331 0.9583586 debye
polarizability: 203.3139663|-1.5720668|149.8652865|-1.2368584|0.0916327|136.8834783 unknown
InChI: InChI=1S/C12H27O2P/c1-3-5-7-9-11-15(13,14)12-10-8-6-4-2/h13H,3-12H2,1-2H3
charge 0 multiplicity 1
42 atoms
P  0.033442 -1.653752 -0.089854
O  0.640335 -2.988604 0.892337
O  0.057466 -1.964825 -1.66603
C  1.163713 -0.268713 0.481761
C  -1.677325 -1.38424 0.633876
C  2.600127 -0.431834 -0.056693
C  -2.443039 -0.233401 -0.053911
C  3.504413 0.760524 0.332151
C  -3.902056 -0.12824 0.447453
C  4.953885 0.601762 -0.179905
C  -4.685759 1.02556 -0.217866
C  5.867349 1.789657 0.200231
C  -6.149743 1.124443 0.268406
C  7.314774 1.621458 -0.310074
C  -6.928358 2.279515 -0.397429
H  1.145188 -0.272601 1.587291
H  0.717701 0.680253 0.12804
H  -1.553556 -1.20896 1.718544
H  -2.21363 -2.343206 0.50836
H  2.568896 -0.534977 -1.159068
H  3.03278 -1.370456 0.341525
H  -2.43941 -0.39543 -1.149828
H  -1.926495 0.731343 0.127867
H  3.073287 1.69955 -0.07411
H  3.516406 0.872539 1.436551
H  -4.424334 -1.087177 0.248871
H  -3.908889 0.00982 1.548839
H  4.943505 0.486943 -1.283763
H  5.386567 -0.336222 0.226413
H  -4.674508 0.889797 -1.319303
H  -4.168669 1.987415 -0.017543
H  5.435857 2.726454 -0.208244
H  5.873873 1.905623 1.303511
H  -6.666449 0.164125 0.065581
H  -6.160322 1.256284 1.369814
H  0.804006 -3.800848 0.348572
H  7.778081 0.707699 0.107752
H  7.338531 1.534309 -1.412756
H  7.947921 2.48195 -0.025481
H  -6.452889 3.255038 -0.18169
H  -6.955975 2.15658 -1.496595
H  -7.972195 2.325448 -0.036303
