program: Gaussian 09
title: 000000170
version: EM64L-G09RevD.01
frameworkgroup: C1[X(C14H14N6O3)]
method: RPBEPBE
basis: SDD
operation: Freq
keyword: #p
keyword: freq=noraman
keyword: PBEPBE/SDD
title: #p freq=noraman PBEPBE/SDD
converged: YES YES NO NO
title: Mulliken charges:
elementType: O O O N N N N N N C C C C C C C C C C C C C C H H H H H H H H H H H H H H
charge: -0.213433 -0.451145 -0.268484 -0.420822 0.026498 -0.397340 -0.448896 -0.039024 -0.623195 0.155880 -0.470731 -0.552169 0.353660 -0.124038 0.483418 -0.012795 0.151295 -0.340945 -0.428717 -0.382380 -0.307411 0.253654 0.099675 0.245334 0.257620 0.220388 0.283259 0.308834 0.301779 0.305518 0.229140 0.223654 0.268391 0.272439 0.307269 0.354307 0.379513
chargesum: 0.00000
title: Mulliken charges with hydrogens summed into heavy atoms:
elementType: O O O N N N N N N C C C C C C C C C C C C C C
charge: -0.213433 -0.071632 -0.268484 -0.111988 0.026498 -0.095560 -0.143378 -0.039024 0.038381 0.155880 0.032223 -0.048522 0.353660 -0.124038 0.483418 -0.012795 0.151295 -0.111805 -0.205064 -0.113989 -0.034972 0.253654 0.099675
polarizability: 3.66868728e+02 3.05895515e+01 1.90388900e+02 -1.92894432e+01 7.07416590e-01 1.45671913e+02
1716.lowfreq: -6.0874 -0.7126 -0.0010 -0.0006 -0.0005 1.6059 12.8999 20.9409 29.0710
frequency: 12.8952 20.9132 28.8875 52.8549 80.9528 89.3339 103.8769 119.5631 135.0438 169.2762 180.0019 212.6189 220.1895 261.6991 272.8132 277.0380 288.6470 318.9622 325.1937 355.2141 382.4146 415.1984 447.6310 453.0552 484.9875 494.4455 498.0791 501.8591 519.7477 543.7166 548.9669 554.9044 566.4899 576.7408 587.2814 627.1482 632.6591 650.1309 655.1919 683.1299 689.9349 698.6276 754.2937 759.7156 786.3577 811.0724 820.3576 833.6416 838.3984 932.9321 964.1881 969.6740 975.7375 983.1916 986.9533 1012.0069 1018.9665 1053.2377 1057.0386 1124.0980 1144.4504 1152.2506 1172.9314 1187.7038 1202.0094 1240.1092 1249.9538 1279.5406 1291.1012 1297.6490 1313.2003 1321.0555 1326.3387 1341.3800 1365.5987 1378.8661 1420.2610 1444.2706 1462.5309 1467.6211 1479.1041 1509.3775 1527.8514 1570.8812 1574.6505 1591.8869 1596.2456 1603.3588 1626.8658 1640.4122 1651.5107 2927.4266 3009.0015 3071.8140 3077.2714 3120.3088 3141.2085 3162.0054 3175.1026 3518.5850 3534.5164 3542.3707 3547.2090 3550.5558 3692.6723
redmass: 6.5048 7.3240 5.7994 5.8177 5.6764 5.9059 4.7061 4.8458 5.4427 5.9312 6.7752 4.2615 1.8241 1.7591 2.0329 3.6085 2.7627 3.6970 3.7223 3.9629 4.7689 2.9590 4.9594 4.5801 4.6087 2.1619 1.6742 2.6992 1.6903 1.6424 2.3121 3.4676 4.1254 1.2339 3.9962 6.2736 6.6935 5.8803 6.1959 3.5780 8.5730 4.5389 4.7028 10.9243 4.5430 5.6904 1.2705 4.3427 1.8662 4.2512 2.4669 2.0785 1.3756 1.3628 4.2548 2.8563 2.3599 3.2053 4.3722 1.4449 2.6815 1.5498 4.8611 2.5439 1.2541 1.2822 1.4894 1.7500 1.8083 1.8315 1.6279 2.2199 1.9700 1.4746 2.2658 3.4991 3.6636 3.8995 1.1719 1.1514 1.7667 2.7845 3.2280 4.7719 3.9181 4.0512 2.2925 3.7353 6.4523 7.8923 3.6878 1.0701 1.0605 1.0923 1.1018 1.0898 1.0870 1.0961 1.0948 1.0774 1.0641 1.0457 1.0781 1.0766 1.1044
irintensity: 3.9126 8.2659 5.3524 5.5962 1.3055 0.5282 4.1043 1.5983 7.3767 4.4308 1.1862 8.6892 23.8348 26.4355 52.5761 31.9498 64.0948 30.0988 21.6989 3.2309 8.8329 0.1052 1.4819 5.0828 20.0164 97.4747 129.6355 118.4608 36.2103 99.7931 60.2357 7.1764 81.3951 75.3245 14.6765 5.9949 5.6822 1.7547 2.6123 67.7022 16.7118 3.8678 20.9812 11.7269 4.7744 4.1692 0.4403 2.7185 67.8565 13.3621 26.1230 16.6120 2.4900 2.5378 138.7716 267.7265 40.1781 17.5644 1.4485 12.5874 6.4443 264.6055 34.2443 22.2968 20.3200 5.8287 6.5126 2.8184 146.7886 22.3082 8.4885 162.1985 58.5346 2.8784 138.1665 144.2259 183.8461 1.5031 27.8691 39.7856 1.1257 158.8002 188.3317 32.8011 156.5694 59.9768 89.4428 492.4113 875.3442 156.2341 423.5287 53.0273 26.0411 4.3167 6.7144 14.2731 10.7649 14.3926 2.1558 13.3565 56.8929 107.8108 18.8732 50.7833 42.8316
temp: 298.150 k
press: 1.00000 atm
elementType: 8 8 8 7 7 7 7 7 7 6 6 6 6 6 6 6 6 6 6 6 6 6 6 1 1 1 1 1 1 1 1 1 1 1 1 1 1
symmnumber: 1
zpe: 729250.7 jmol-1
zpe.correction: 0.277757 hartree
zpe.thermalcorrener: 0.298455 hartree
zpe.thermalcorrenthalpy: 0.299399 hartree
zpe.thermalcorrgfe: 0.226004 hartree
zpe.sumelectzpe: -1094.436081 hartree
zpe.sumelectthermal: -1094.415383 hartree
zpe.sumelectthermalent: -1094.414438 hartree
zpe.sumelectthermalfe: -1094.487834 hartree
dipole: 0.5725 8.7035 2.0974
dipole: 8.9709
quadrupole: -174.2380 -122.5654 -129.4333
quadrupole: -49.0202 7.5933 4.5962
quadrupole: -32.1591 19.5135 12.6456 -49.0202 7.5933 4.5962
hfenergy: -1094.7138375 hartree
pointgroup: C01 [X(C14H14N6O3)]
dipole: -0.0894842 -2.0037222 -2.9041413 debye
polarizability: 360.0775105|-46.4655798|175.0726921|-17.090004|25.6817664|167.7793383 unknown
InChI: InChI=1S/C14H14N6O3/c15-14-19-11-10(12(21)20-14)18-9(6-17-11)5-16-8-3-1-7(2-4-8)13(22)23/h1-4,16-17,19,22H,5-6,15H2
charge 0 multiplicity 1
37 atoms
O  -5.0258 1.615823 1.819934
O  6.513708 -0.982691 -1.985469
O  6.316966 -2.430284 -0.177635
N  -1.897486 -1.347575 -0.368919
N  -2.245965 0.964166 1.185483
N  1.088849 1.440443 0.461683
N  -4.223836 -1.324379 -0.94235
N  -5.765096 0.228122 0.077072
N  -6.501222 -1.255441 -1.586528
C  -1.065493 0.392619 1.150866
C  -0.885875 -1.060821 0.674259
C  0.154361 1.198338 1.573419
C  -3.160129 -0.804909 -0.199309
C  -3.366501 0.26895 0.675334
C  2.240759 0.719817 0.166716
C  -4.742827 0.763832 0.935283
C  -5.499723 -0.732952 -0.782751
C  2.699852 -0.373673 0.969652
C  3.010598 1.0830 -0.986492
C  3.87559 -1.058248 0.628869
C  4.179977 0.389567 -1.318894
C  4.632853 -0.695812 -0.51694
C  5.855598 -1.456126 -0.828458
H  -1.010759 -1.755455 1.534202
H  0.121969 -1.218379 0.256325
H  0.696645 0.698983 2.397192
H  -0.214876 2.163524 1.96082
H  -1.609282 -1.741259 -1.26551
H  0.81944 2.177255 -0.191849
H  -4.12267 -2.229336 -1.407642
H  2.147778 -0.680908 1.863289
H  2.677095 1.922514 -1.609383
H  4.230943 -1.891347 1.244934
H  4.760905 0.677371 -2.19967
H  -6.309531 -1.77963 -2.43697
H  -7.429116 -0.861324 -1.444765
H  7.326502 -1.538076 -2.124797
