program: Gaussian 09
title: 000081963
version: EM64L-G09RevD.01
frameworkgroup: C1[X(C6H7ClN2OS)]
method: RPBEPBE
basis: SDD
operation: Freq
keyword: #p
keyword: freq=noraman
keyword: PBEPBE/SDD
title: #p freq=noraman PBEPBE/SDD
converged: YES YES NO NO
title: Mulliken charges:
elementType: Cl S O N N C C C C C C H H H H H H H
charge: -0.076936 0.261269 -0.189288 -0.366099 0.036151 0.517497 -0.167305 -0.656143 -0.723561 0.224340 -0.772413 0.284669 0.325072 0.263601 0.293992 0.262775 0.265829 0.216548
chargesum: 0.00000
title: Mulliken charges with hydrogens summed into heavy atoms:
elementType: Cl S O N N C C C C C C
charge: -0.076936 0.261269 -0.189288 -0.041026 0.036151 0.517497 -0.167305 -0.371474 -0.165967 0.224340 -0.027261
polarizability: 1.49083930e+02 -3.54393604e+00 1.13976342e+02 -5.91695594e+00 -2.84571651e+00 7.07395068e+01
1716.lowfreq: -5.9361 0.0019 0.0030 0.0032 1.5025 10.1696 23.0243 41.7953 64.5761
frequency: 22.7511 41.7648 64.5519 78.4299 99.6050 110.6216 259.8502 279.7349 282.0391 301.4111 379.0215 509.5751 519.3700 539.2623 559.5930 573.7073 604.2028 615.3489 702.7782 747.7346 780.5241 815.3987 867.3286 913.3039 952.8636 993.5836 1035.5428 1111.0196 1126.0247 1173.3549 1203.1562 1253.2064 1331.8085 1386.2939 1440.1863 1442.7048 1457.0108 1471.0560 1506.4132 1571.6966 1665.1358 2995.0613 3082.8016 3085.1674 3122.2370 3169.3407 3239.2873 3546.2041
redmass: 7.1961 5.6961 1.1589 4.6522 4.1198 8.0646 8.7163 5.2544 3.5639 4.6949 3.6636 5.0436 5.0343 5.8090 1.6726 2.9124 5.8553 5.5375 3.2883 4.8925 1.6786 5.0851 3.5673 1.9326 3.1122 2.2790 1.6573 1.4759 1.8149 1.8074 2.4719 1.1557 4.3765 1.2178 1.2812 1.1325 1.3001 1.0866 7.1319 7.3589 7.6660 1.0373 1.0573 1.0987 1.0988 1.1118 1.0962 1.0772
irintensity: 5.3399 3.2488 2.0389 4.2392 4.9058 1.6988 2.9950 3.4421 1.6321 3.6166 1.8034 7.5532 48.2553 8.3834 49.7929 40.8537 89.2284 34.9132 23.0623 5.1921 30.9212 9.1333 3.1461 4.4830 36.9842 9.5985 17.2511 35.0710 41.6374 3.0600 240.7991 18.8435 1.1287 78.0490 277.5350 17.2352 193.7718 48.5614 1.3690 158.7183 155.4804 8.2780 13.7543 15.1198 8.4046 2.2035 2.9033 26.9671
temp: 298.150 k
press: 1.00000 atm
elementType: 17 16 8 7 7 6 6 6 6 6 6 1 1 1 1 1 1 1
symmnumber: 1
zpe: 329146.9 jmol-1
zpe.correction: 0.125365 hartree
zpe.thermalcorrener: 0.137116 hartree
zpe.thermalcorrenthalpy: 0.138061 hartree
zpe.thermalcorrgfe: 0.084485 hartree
zpe.sumelectzpe: -1274.862294 hartree
zpe.sumelectthermal: -1274.850543 hartree
zpe.sumelectthermalent: -1274.849599 hartree
zpe.sumelectthermalfe: -1274.903174 hartree
dipole: 2.7265 3.8558 -1.1524
dipole: 4.8610
quadrupole: -67.0275 -81.3660 -78.8311
quadrupole: -2.1642 -15.3968 1.3125
quadrupole: 8.7140 -5.6245 -3.0895 -2.1642 -15.3968 1.3125
hfenergy: -1274.9876597 hartree
pointgroup: C01 [X(C6H7Cl1N2O1S1)]
dipole: 0.9015932 1.6860408 -0.0443121 debye
dipolederiv: -0.4294157 -0.2197881 -0.1398883 -0.184856 -0.3156871 -0.0788056 -0.3897517 -0.3068259 -0.4718097 -0.3224063 -0.1101241 -0.0160998 0.2076865 -0.5565924 -0.0826748 0.1052194 -0.0437839 0.1208109 -0.4830563 -0.0659888 0.1223652 0.4137362 -0.7463662 0.2678076 -0.1939826 0.3508112 -0.5510132 -1.7740155 0.5871433 -0.1076672 0.7576749 -0.7129965 0.0264262 -0.1521934 0.0680467 -0.3927687 -0.5570063 -0.1589268 0.0382889 -0.2775654 -0.6357339 -0.0508426 0.1173471 -0.0277749 -0.1479107 0.2192467 -0.0034843 -0.0429456 -0.0976053 -0.0645554 -0.0287114 0.0752422 0.0611769 -0.0336034 1.4379107 -0.395673 -0.0804262 -0.2371143 0.9082668 0.18616 -0.3631718 0.2572108 0.0283129 -0.0378698 0.2624509 -0.020603 0.2162601 0.1685972 0.0257321 -0.021056 -0.0570567 -0.3015717 0.5416352 0.3452526 0.2290978 0.2751383 0.3950556 0.1903879 0.3743387 0.2780421 0.6104328 1.4801458 -0.3500646 -0.0793103 -1.2102231 1.1794978 -0.5001337 0.2620341 -0.5929118 0.6346348 -0.4233801 0.0303717 0.1166573 0.1138809 0.0328844 -0.0114295 0.2102721 0.0037562 -0.0750787 0.0122261 0.0208495 0.0306425 0.0001143 0.1083211 -0.001801 0.0007957 0.0153768 0.2119955 0.1730571 0.0251636 0.0224499 0.0636094 0.1503684 0.0760994 0.0903637 0.0428122 0.285641 -0.038636 -0.021886 0.0295288 0.0600538 0.0591543 -0.0934676 0.0120194 -0.0633208 -0.039585 0.0573894 0.0364089 -0.0760373 -0.023819 -0.0072481 0.0242516 -0.0816923 -0.0105613 -0.002268 0.0645613 -0.0100742 0.0064323 -0.0091447 0.0481425 -0.0894085 0.0416064 -0.0857314 0.0049283 0.0215177 0.0194926 -0.0523895 0.0126552 0.1071367 0.0619714 -0.1150485 0.0478503 0.0206807 0.0580959 0.0088767 0.0199046 -0.0804819 -0.118245 0.0784383 0.0276572 0.0628835 0.0981721 unknown
polarizability: 149.7752511|1.1423986|113.2892996|1.2594612|5.2769327|70.7352279 unknown
InChI: InChI=1S/C6H7ClN2OS/c1-4(10)8-6-9-5(2-7)3-11-6/h3,8H,2H2,1H3
charge 0 multiplicity 1
18 atoms
Cl -3.56537 -1.351226 -1.313278
S  -0.435499 2.387902 0.299572
O  2.243646 -1.266778 0.982378
N  1.741414 0.66765 -0.261885
N  -0.473974 -0.286522 0.019271
C  -1.78677 0.118267 0.317485
C  0.363682 0.721459 -0.037036
C  -1.969107 1.486429 0.474596
C  -2.860325 -0.908243 0.412704
C  2.617719 -0.344577 0.222617
C  4.046563 -0.202748 -0.294963
H  -2.899452 2.021157 0.654814
H  2.160501 1.435401 -0.790085
H  -3.731572 -0.562161 0.98372
H  -2.473304 -1.860553 0.797987
H  4.185024 -0.874485 -1.161871
H  4.74383 -0.527113 0.492886
H  4.303794 0.82444 -0.608309
