program: Gaussian 09
title: 000081961
version: EM64L-G09RevD.01
frameworkgroup: C1[X(C11H18O6)]
method: RPBEPBE
basis: SDD
operation: Freq
keyword: #pfreq=noraman
keyword: PBEPBE/SDD
title: #p freq=noraman PBEPBE/SDD
converged: YES YES NO NO
title: Mulliken charges:
elementType: O O O O O O C C C C C C C C C C C H H H H H H H H H H H H H H H H H H
charge: -0.259266 -0.268952 -0.261741 -0.235495 -0.216542 -0.248302 -0.280582 -0.561563 0.259263 0.226038 0.276053 -0.223067 -0.221536 -0.227167 -0.675240 -0.671578 -0.672666 0.294857 0.279940 0.275074 0.230511 0.233414 0.232665 0.229794 0.233744 0.226426 0.233673 0.230973 0.210619 0.228672 0.233130 0.214274 0.228721 0.233953 0.211903
chargesum: 0.00000
title: Mulliken charges with hydrogens summed into heavy atoms:
elementType: O O O O O O C C C C C C C C C C C
charge: -0.259266 -0.268952 -0.261741 -0.235495 -0.216542 -0.248302 0.014274 -0.006549 0.259263 0.226038 0.276053 0.240859 0.240923 0.233003 0.000026 0.004498 0.001911
polarizability: 1.61022057e+02 1.29728962e+00 1.48776145e+02 4.00614964e+00 3.11782968e-01 1.12152631e+02
1716.lowfreq: -13.6462 -6.3455 -2.6916 -0.0008 -0.0007 -0.0001 3.5720 18.3920 25.8575
frequency: -12.0687 17.7944 25.5303 37.3836 48.4364 56.2443 61.2018 65.9175 84.2326 115.9784 122.9483 141.9795 146.4159 184.7552 202.1989 224.4384 244.4843 251.6204 258.3506 274.4199 307.0539 324.9334 351.7803 378.3202 396.9101 490.0407 536.1620 575.1999 649.2047 673.5362 698.3665 762.6504 797.6316 798.2030 799.7798 805.5926 810.3405 832.0288 873.1548 914.2581 942.9668 996.9964 1020.4169 1023.5120 1026.8448 1092.5203 1111.7612 1113.5253 1114.8414 1121.7696 1134.8091 1135.8685 1136.5189 1139.5364 1167.6237 1200.2296 1238.6210 1248.7385 1249.3376 1251.0813 1317.1247 1339.1389 1355.6688 1360.4678 1363.9840 1399.4439 1400.8348 1401.0811 1430.0582 1462.9504 1463.1879 1463.3392 1473.3219 1473.5899 1473.7163 1485.9288 1486.1312 1486.3816 1635.6512 1638.9812 1647.0735 2996.5172 2996.7226 2996.7798 3011.7731 3012.3092 3013.3739 3024.0016 3042.2369 3070.9998 3071.3499 3073.1070 3089.4197 3093.2422 3093.4841 3093.5804 3108.6667 3108.8276 3109.6250
redmass: 3.5929 3.3798 3.4729 3.0220 4.2293 4.9205 2.8568 2.4794 9.6045 3.1798 2.7574 2.6441 2.6442 3.0883 2.9960 2.4509 1.3112 1.4377 1.8468 3.2197 5.7240 5.6743 3.6188 3.5486 3.9377 4.3121 3.1440 7.0268 6.5169 4.6041 6.2428 6.4316 1.1033 1.1012 1.1056 3.6211 3.6638 4.0501 4.0968 5.8716 3.9914 2.6066 2.2529 2.3906 2.7071 4.1618 2.3843 2.3020 2.2381 2.4715 1.4733 1.4935 1.4681 2.6904 2.7671 1.4939 1.5698 1.1405 1.1341 1.1384 1.6281 1.4814 1.3767 1.4487 1.5580 1.2618 1.2722 1.2708 1.0903 1.0401 1.0399 1.0402 1.0616 1.0626 1.0609 1.0666 1.0688 1.0691 10.3981 9.7509 10.9601 1.0358 1.0358 1.0358 1.0582 1.0582 1.0582 1.0607 1.0821 1.1066 1.1066 1.1066 1.1000 1.0985 1.0985 1.0985 1.1028 1.1027 1.1029
irintensity: 0.4897 0.7022 0.9337 0.5592 0.4863 1.3379 1.9432 1.3556 0.2961 0.4821 1.0362 2.1422 5.8950 6.9621 10.4121 1.0512 0.9378 1.3790 3.6842 13.3118 3.5122 19.3536 13.2984 0.3211 3.9954 12.0478 4.6679 15.5078 0.4650 3.8423 3.8486 4.4487 5.4913 4.0604 5.1040 12.6299 8.9176 2.4077 13.2118 29.2019 3.6177 35.8230 26.7656 103.8118 154.9063 88.0621 44.0756 34.1540 2.4267 291.3132 4.2829 25.6629 4.4121 453.7174 21.6413 73.6549 236.2360 3.2167 0.1984 3.0110 111.4159 23.1951 1.2048 4.2496 12.6003 22.2349 27.1995 13.7156 41.9632 12.2551 12.3392 12.6023 2.1130 4.6174 5.9171 13.3505 14.7464 13.6764 148.7481 230.1480 153.8963 20.2170 40.4382 1.1141 19.6141 17.0487 16.7051 6.4792 4.6677 6.9166 6.2104 5.3115 0.5985 33.2743 23.7198 31.0990 42.5580 42.2716 40.2482
temp: 298.150 k
press: 1.00000 atm
elementType: 8 8 8 8 8 8 6 6 6 6 6 6 6 6 6 6 6 1 1 1 1 1 1 1 1 1 1 1 1 1 1 1 1 1 1
symmnumber: 1
zpe: 737922.9 jmol-1
zpe.correction: 0.281060 hartree
zpe.thermalcorrener: 0.300913 hartree
zpe.thermalcorrenthalpy: 0.301857 hartree
zpe.thermalcorrgfe: 0.228974 hartree
zpe.sumelectzpe: -879.979536 hartree
zpe.sumelectthermal: -879.959683 hartree
zpe.sumelectthermalent: -879.958739 hartree
zpe.sumelectthermalfe: -880.031622 hartree
dipole: 0.2405 2.1502 -1.1942
dipole: 2.4713
quadrupole: -83.3145 -83.4373 -108.8925
quadrupole: -0.2422 3.0651 1.1279
quadrupole: 8.5669 8.4442 -17.0111 -0.2422 3.0651 1.1279
hfenergy: -880.2605958 hartree
pointgroup: C01 [X(C11H18O6)]
dipole: 0.5581182 -0.7697809 -0.2031543 debye
polarizability: 152.5147276|3.7190371|147.5131441|-5.8999029|-18.6139345|121.9229615 unknown
InChI: InChI=1S/C11H18O6/c1-4-15-9(12)7-8(10(13)16-5-2)11(14)17-6-3/h8H,4-7H2,1-3H3
charge 0 multiplicity 1
35 atoms
O  -0.814125 2.19749 -1.3392
O  2.406836 -0.253052 -0.351607
O  -2.029807 -2.433461 1.299812
O  -1.724843 1.619273 0.726689
O  1.81337 1.865739 0.418232
O  -2.155944 -1.480608 -0.823425
C  0.064479 0.23728 -0.288788
C  -0.310012 -0.878222 0.712021
C  -0.926642 1.402761 -0.211199
C  1.488211 0.745275 -0.02893
C  -1.583365 -1.594695 0.285518
C  -1.677002 3.42079 -1.373651
C  3.850333 0.083446 -0.128448
C  -3.279856 -3.208482 1.01303
C  -1.361316 4.143843 -2.678026
C  4.655189 -1.148902 -0.525507
C  -3.588006 -4.021924 2.265086
H  0.031483 -0.17024 -1.315262
H  -0.459745 -0.464106 1.723677
H  0.50616 -1.621044 0.767759
H  -2.731461 3.09719 -1.308782
H  -1.442592 4.028066 -0.481127
H  4.093856 0.968192 -0.743653
H  3.980843 0.355631 0.934479
H  -4.079681 -2.488027 0.764819
H  -3.097729 -3.842206 0.126154
H  -0.297344 4.432591 -2.718998
H  -1.583739 3.502646 -3.547949
H  -1.974692 5.060126 -2.754461
H  4.379411 -2.018937 0.09459
H  4.484378 -1.407204 -1.584383
H  5.733425 -0.950701 -0.385425
H  -2.763218 -4.716831 2.498182
H  -3.743041 -3.360999 3.134687
H  -4.50831 -4.613799 2.108883
