program: Gaussian 09
title: 000081904
version: EM64L-G09RevD.01
frameworkgroup: C1[X(C2HBr2N3)]
method: RPBEPBE
basis: SDD
operation: Freq
keyword: #p
keyword: freq=noraman
keyword: PBEPBE/SDD
title: #p freq=noraman PBEPBE/SDD
converged: NO NO NO NO
title: Mulliken charges:
elementType: Br Br N N N C C H
charge: 0.107911 0.086051 -0.344938 0.032829 0.026913 -0.072205 -0.200056 0.363496
chargesum: 0.00000
title: Mulliken charges with hydrogens summed into heavy atoms:
elementType: Br Br N N N C C
charge: 0.107911 0.086051 0.018558 0.032829 0.026913 -0.072205 -0.200056
polarizability: 1.22873153e+02 -1.18996776e+00 5.29939335e+01 -2.58517890e-03 2.63726834e-03 2.33608457e+01
1716.lowfreq: -6.1850 -0.0003 -0.0002 0.0004 3.2665 21.9736 125.1354 139.8364 261.3478
frequency: 125.0748 139.8363 261.3477 279.2271 341.6945 436.9631 622.2657 674.1299 687.5470 902.8416 965.4224 1068.6964 1178.2509 1209.8730 1287.6545 1327.9877 1425.2576 3603.7080
redmass: 14.1392 20.6829 27.6357 9.3383 8.4212 15.7917 7.3417 1.4693 4.3033 10.9809 8.8955 6.2701 3.8818 8.9721 7.0212 8.5817 1.9123 1.0837
irintensity: 4.1373 0.1022 0.2755 4.7881 4.3500 6.7961 14.9313 98.5317 19.0015 1.8193 42.6745 16.0746 0.4353 282.1109 1.2851 111.9984 133.2599 94.0564
temp: 298.150 k
press: 1.00000 atm
elementType: 35 35 7 7 7 6 6 1
symmnumber: 1
zpe: 98917.9 jmol-1
zpe.correction: 0.037676 hartree
zpe.thermalcorrener: 0.043996 hartree
zpe.thermalcorrenthalpy: 0.044941 hartree
zpe.thermalcorrgfe: 0.004424 hartree
zpe.sumelectzpe: -267.431339 hartree
zpe.sumelectthermal: -267.425019 hartree
zpe.sumelectthermalent: -267.424074 hartree
zpe.sumelectthermalfe: -267.464591 hartree
dipole: -2.6920 2.1985 -0.0001
dipole: 3.4757
quadrupole: -52.2514 -57.5924 -58.9378
quadrupole: -6.1048 -0.0003 -0.0007
quadrupole: 4.0091 -1.3318 -2.6772 -6.1048 -0.0003 -0.0007
hfenergy: -267.469015 hartree
pointgroup: C01 [X(C2H1Br2N3)]
dipole: -1.0376318 0.8906236 -0.0000391 debye
dipolederiv: -0.5745036 -0.1128037 0.0000179 -0.1103757 -0.0146041 -0.0000115 -0.0001816 -0.0000319 0.0769276 -0.4959228 0.1267599 0.0000182 0.1468707 -0.0310138 -0.000013 0.0003354 -0.0001189 0.0451837 -0.5447726 0.2989017 -0.0000839 0.1763392 -0.3419722 -0.0000918 -0.0000567 -0.0000533 -0.190828 -1.1890733 0.1032457 0.0000313 0.0492664 -0.4538121 0.0000871 -0.0000158 -0.0001601 -0.1338665 -0.3338209 -0.2582735 0.0000347 0.0386913 -0.3768706 -0.0001583 0.0000608 0.0001049 -0.1143298 1.4002132 0.1322156 -0.0000223 0.0176753 0.5953031 0.0000762 0.000179 0.0000854 -0.007159 1.5538023 -0.2573264 -0.0000117 -0.2895645 0.3501556 0.0000925 -0.000321 0.0001641 -0.0546275 0.1840778 -0.0327193 0.0000158 -0.0289027 0.2728141 0.0000187 -0.0000002 0.0000098 0.3786995 unknown
polarizability: 122.7730958|-2.8979149|53.0939904|-0.0025199|0.0026997|23.3608457 unknown
InChI: InChI=1S/C2HBr2N3/c3-1-5-2(4)7-6-1/h6H
charge 0 multiplicity 1
8 atoms
Br -2.923369 -0.579879 -0.00003
Br 2.86521 -0.71207 -0.000076
N  -0.630522 1.200173 0.000066
N  -0.028149 -0.958002 -0.000263
N  0.767002 1.238337 -0.000075
C  -1.074026 -0.108582 0.000128
C  1.060913 -0.095709 0.000322
H  -1.161259 2.070233 -0.000073
