program: Gaussian 09
title: 000081895
version: EM64L-G09RevD.01
frameworkgroup: C1[X(C8H5Br3O)]
method: RPBEPBE
basis: SDD
operation: Freq
keyword: #p
keyword: freq=noraman
keyword: PBEPBE/SDD
title: #p freq=noraman PBEPBE/SDD
converged: YES YES NO NO
title: Mulliken charges:
elementType: Br Br Br O C C C C C C C C H H H H H
charge: 0.140455 0.139571 0.183385 -0.158042 0.329643 0.346240 -0.332323 -0.306867 -0.225410 -0.249503 -0.910086 -0.218368 0.279728 0.264969 0.239737 0.237661 0.239209
chargesum: 0.00000
title: Mulliken charges with hydrogens summed into heavy atoms:
elementType: Br Br Br O C C C C C C C C
charge: 0.140455 0.139571 0.183385 -0.158042 0.329643 0.346240 -0.052595 -0.041898 0.014327 -0.011842 -0.910086 0.020841
polarizability: 1.85291216e+02 1.31642465e+01 1.36624060e+02 -6.76180299e-01 -1.89152980e-01 1.01812551e+02
1716.lowfreq: -0.0007 -0.0005 -0.0003 5.1894 6.7741 8.3717 20.8552 62.3491 85.0918
frequency: 20.8141 62.3175 85.0907 106.4898 142.8888 154.2380 176.6523 177.9473 187.3388 235.6488 350.1053 400.5672 427.5366 466.9117 537.5057 605.2625 613.3842 686.2991 690.1659 712.5078 757.2906 807.8997 855.2628 953.5730 961.5674 989.9585 995.1566 1012.6220 1031.6100 1094.7179 1177.7505 1196.0307 1213.8277 1324.9748 1388.6124 1436.3845 1477.3651 1565.1688 1591.8647 1609.9014 3135.5516 3148.1522 3161.0626 3172.4349 3187.5005
redmass: 8.7078 5.6196 16.2522 10.1132 15.6124 17.8213 17.0124 7.2715 9.6503 15.4490 11.3898 2.8155 3.9694 8.9542 8.4392 9.4629 6.4475 9.1203 2.1068 2.3571 9.0906 2.6429 1.2478 1.4250 8.6217 6.1855 1.3908 1.3454 2.1307 1.5890 1.0603 1.3277 2.7812 1.3167 8.2800 2.3096 2.1243 8.2903 6.9785 6.3403 1.0859 1.0897 1.0944 1.0982 1.0962
irintensity: 1.4491 0.4949 0.7085 0.7804 0.0969 0.2361 0.7162 0.1587 1.2806 4.5478 6.8119 0.0015 4.9036 5.9754 146.7654 122.8040 2.1717 90.7986 56.8692 2.9729 14.1616 69.9594 0.3245 4.6414 43.6085 3.6740 0.8706 0.2530 2.6579 7.5686 2.4058 99.0109 105.6518 2.2136 3.8093 22.6630 0.5127 102.7066 33.2092 14.9626 0.3962 10.4737 11.5828 20.4750 4.0563
temp: 298.150 k
press: 1.00000 atm
elementType: 35 35 35 8 6 6 6 6 6 6 6 6 1 1 1 1 1
symmnumber: 1
zpe: 275655.0 jmol-1
zpe.correction: 0.104991 hartree
zpe.thermalcorrener: 0.117223 hartree
zpe.thermalcorrenthalpy: 0.118167 hartree
zpe.thermalcorrgfe: 0.062705 hartree
zpe.sumelectzpe: -422.567175 hartree
zpe.sumelectthermal: -422.554944 hartree
zpe.sumelectthermalent: -422.554000 hartree
zpe.sumelectthermalfe: -422.609461 hartree
dipole: -3.7972 -1.6578 0.0547
dipole: 4.1436
quadrupole: -80.0135 -96.6695 -99.0731
quadrupole: -0.2403 -0.0533 0.1772
quadrupole: 11.9052 -4.7508 -7.1544 -0.2403 -0.0533 0.1772
hfenergy: -422.6721667 hartree
pointgroup: C01 [X(C8H5Br3O1)]
dipole: -1.5270124 -0.5444995 0.171528 debye
dipolederiv: -0.1691206 -0.010572 0.0861481 0.036289 -0.1380271 0.258752 0.0072047 0.2056044 -0.8111723 -0.1704516 -0.0467576 -0.0622918 0.0321227 -0.523572 -0.4336333 -0.0218427 -0.3799027 -0.4297761 -0.6871887 -0.2934399 0.0775463 -0.3545224 -0.1568237 0.0290961 0.0948934 0.029913 -0.0493761 -0.7819426 0.0244607 -0.0047267 -0.28416 -0.7793076 0.176698 0.0816611 0.1727498 -0.2362229 -0.8913406 -0.0699232 0.0266468 0.0575845 -0.076817 0.0299222 -0.0103003 0.0272383 0.0102059 1.6893363 -0.2458665 0.0607893 -0.1007422 0.76936 -0.24781 0.0201263 -0.2426561 -0.0051476 0.1481607 0.1552837 -0.0447269 -0.2250144 0.0244381 -0.0281016 0.0621451 -0.0317483 -0.0802862 0.2013203 -0.0841301 0.0206634 0.1897686 -0.0161464 -0.0154345 -0.0592414 -0.0110386 -0.0593172 -0.1259828 -0.213713 0.0559482 -0.2281185 -0.0263502 -0.0321777 0.0615084 -0.0323841 -0.148421 -0.2826752 0.1497331 -0.0396569 0.192981 0.0912467 -0.0676418 -0.0500959 -0.0684714 -0.136013 0.7583323 0.6060621 -0.1720078 0.6120504 0.6834139 0.2045195 -0.1684356 0.2034266 1.3549482 0.181408 0.0281873 -0.0118193 0.0169008 0.0609698 -0.0469538 -0.0086715 -0.046555 -0.1002801 0.1278816 -0.0730857 0.0200826 -0.0151021 0.0293866 0.0320161 0.0024776 0.0337268 0.1420628 0.0798839 0.0605257 -0.0152778 0.0820349 0.0306797 0.0229442 -0.0218545 0.0227801 0.1122366 -0.0194694 0.0878638 -0.0216525 0.0989515 -0.0080182 0.0436186 -0.0245962 0.0433112 0.1477216 0.0503016 -0.042584 0.012585 -0.0755874 -0.0612794 0.0584068 0.0224235 0.0580801 0.1388271 -0.1084533 -0.0320443 0.0117499 -0.0354365 0.0968466 0.015779 0.0125982 0.0159259 0.1500105 unknown
polarizability: 186.567427|9.844802|133.0885227|-3.6512589|-8.394221|104.0718773 unknown
InChI: InChI=1S/C8H5Br3O/c9-8(10,11)7(12)6-4-2-1-3-5-6/h1-5H
charge 0 multiplicity 1
17 atoms
Br 1.938969 -0.999575 2.030025
Br 1.959451 -1.894611 -1.192498
Br 3.859201 0.532935 -0.118395
O  1.235051 1.850082 -0.525769
C  -0.541994 0.295812 -0.064048
C  0.900936 0.688171 -0.185119
C  -1.482395 1.334528 -0.332049
C  -1.025795 -0.995475 0.28729
C  -2.865322 1.090931 -0.249419
C  -2.413206 -1.234062 0.368177
C  2.068355 -0.336289 0.111904
C  -3.336645 -0.196731 0.102116
H  -1.101023 2.324095 -0.602156
H  -0.338352 -1.817241 0.496563
H  -3.574375 1.899001 -0.457233
H  -2.773602 -2.231884 0.639236
H  -4.413055 -0.389989 0.167674
