program: Gaussian 09
title: 000081971
version: EM64L-G09RevD.01
frameworkgroup: C1[X(C12H28O4P2S5)]
method: RPBEPBE
basis: SDD
operation: Freq
keyword: #p
keyword: freq=noraman
keyword: PBEPBE/SDD
title: #p freq=noraman PBEPBE/SDD
converged: NO YES NO NO
title: Mulliken charges:
elementType: S S S S S P P O O O O C C C C C C C C C C C C H H H H H H H H H H H H H H H H H H H H H H H H H H H H
charge: -0.023554 -0.025803 0.002436 -0.242002 -0.242729 0.601864 0.603320 -0.457873 -0.453622 -0.454851 -0.457180 0.014973 0.021901 0.021621 0.015325 -0.660827 -0.657864 -0.663139 -0.654505 -0.662366 -0.654097 -0.660483 -0.658211 0.233850 0.235456 0.235423 0.233979 0.207149 0.234366 0.229012 0.214942 0.241084 0.226347 0.202015 0.246166 0.228491 0.212078 0.230732 0.232408 0.202478 0.244660 0.228852 0.212006 0.231368 0.232388 0.207114 0.234414 0.229013 0.215309 0.240166 0.226397
chargesum: 0.00000
title: Mulliken charges with hydrogens summed into heavy atoms:
elementType: S S S S S P P O O O O C C C C C C C C C C C C
charge: -0.023554 -0.025803 0.002436 -0.242002 -0.242729 0.601864 0.603320 -0.457873 -0.453622 -0.454851 -0.457180 0.248823 0.257357 0.257044 0.249303 0.009701 0.024509 0.013534 0.020714 0.013625 0.021665 0.010057 0.023661
polarizability: 4.69428670e+02 -8.70861037e+00 2.90699168e+02 -1.31743971e+00 5.34993252e-02 2.54178604e+02
1716.lowfreq: -7.0372 0.0006 0.0008 0.0017 3.4771 9.1365 13.7405 15.9120 18.7178
frequency: 12.2853 15.0085 16.0398 20.5055 24.3111 26.8114 32.7274 34.4766 35.7016 42.2058 44.0372 53.2066 65.9605 85.5532 92.9131 103.2635 109.1728 110.3861 126.6479 132.0794 153.4971 157.9690 184.2785 186.0352 186.4733 192.0817 193.4521 208.3042 211.0948 223.5556 227.1213 228.8793 233.3459 247.0742 249.1780 274.1025 275.1115 317.6025 320.1204 328.9164 341.3981 342.6532 354.9932 372.9945 398.4811 410.7527 413.4105 425.3178 425.8535 448.0878 450.2492 461.7095 463.2410 534.2773 540.6741 656.6163 657.3758 683.0835 683.2576 812.7134 813.0394 820.2485 822.7491 894.9618 896.2126 901.3958 902.7247 926.2978 926.6173 927.0246 927.9342 937.6061 938.9929 939.1425 940.8657 1090.0883 1091.4902 1096.1885 1098.9552 1151.5588 1153.3942 1154.3837 1155.0774 1177.4019 1177.5651 1179.1589 1179.5997 1315.8958 1322.7265 1325.4433 1325.8978 1332.1155 1333.4984 1333.7739 1336.6258 1380.2875 1380.5920 1381.0119 1381.5074 1394.9751 1395.3132 1395.8809 1396.4406 1452.9544 1453.2951 1453.5102 1454.0565 1459.7172 1460.1926 1461.0088 1461.9724 1468.5137 1469.5191 1469.6160 1470.4637 1482.1973 1482.4079 1482.8062 1483.6656 2986.1497 2986.3660 2986.8963 2987.2062 2992.9392 2993.6144 2993.6416 2993.7551 2994.7766 2995.2777 2999.3253 2999.9074 3082.2898 3082.8605 3083.4541 3083.7751 3091.4479 3091.8714 3092.1576 3092.6196 3096.1604 3096.6074 3099.8339 3100.0811 3105.8560 3106.0701 3107.1202 3107.2943
redmass: 4.3584 4.5051 4.4691 5.9729 3.9436 3.1138 3.4943 2.7170 2.8184 4.9484 3.1596 7.4675 5.4536 5.6597 14.0417 7.1421 5.3756 5.7844 7.9179 7.9403 8.4528 8.3411 1.0503 1.0654 1.0380 1.1350 4.5690 3.5587 3.3725 1.4492 1.3704 1.1819 1.2942 4.6147 4.3657 2.8991 2.7654 6.3170 4.1545 4.5294 2.7195 2.7256 3.7215 5.4644 26.8009 3.5288 3.5770 2.9634 3.0178 3.4659 3.3272 3.7535 3.9550 8.7412 9.1084 4.7905 4.8139 6.4525 6.4373 5.6375 5.8240 5.6327 5.1333 2.8572 2.8446 2.9429 2.9664 1.2182 1.2223 1.2287 1.2322 1.3439 1.3303 1.3305 1.3466 1.6281 1.6330 1.6648 1.6757 2.0987 2.1336 2.0840 2.0847 1.9517 1.9483 1.9375 1.9427 1.1738 1.2021 1.1962 1.2235 1.4115 1.4961 1.4362 1.4300 1.2547 1.2528 1.2550 1.2575 1.2141 1.2172 1.2149 1.2167 1.0489 1.0476 1.0491 1.0491 1.0495 1.0496 1.0477 1.0483 1.0475 1.0473 1.0474 1.0476 1.0489 1.0497 1.0492 1.0495 1.0356 1.0356 1.0357 1.0356 1.0430 1.0401 1.0377 1.0428 1.0781 1.0733 1.0851 1.0851 1.0991 1.0989 1.0991 1.0991 1.0999 1.1000 1.0996 1.0995 1.1001 1.0998 1.1004 1.1005 1.1007 1.1007 1.1007 1.1007
irintensity: 0.3468 0.0667 0.2432 0.4114 0.4003 0.5883 1.0958 0.2517 0.1279 0.0947 0.5544 0.3992 0.8447 1.9234 0.3566 1.0494 1.8296 1.8532 0.1911 0.7111 7.4023 7.9040 0.0262 0.0877 0.0376 0.3166 2.0997 2.5897 11.7673 0.9097 0.4478 0.2369 0.7615 2.2577 3.3222 2.0856 1.8034 56.5676 2.3098 94.0340 4.7368 1.1534 4.9612 11.0180 0.5901 2.3645 2.1593 5.4311 4.6869 84.9144 16.6851 27.8236 7.3959 256.4735 1.5956 51.1824 16.6718 40.2152 96.1015 348.5403 122.8714 207.5730 116.2011 67.7728 75.7433 119.6383 11.0831 3.0247 2.7189 2.5818 2.3484 0.1966 0.0936 0.1683 0.2952 81.7784 141.9168 178.8635 20.9641 9.4761 10.0832 17.6454 12.4610 13.7527 14.4159 12.6081 12.3569 17.8670 15.1240 31.5747 17.8840 8.2328 5.5179 8.4537 5.9858 41.0172 17.4403 35.2017 25.9280 30.1330 19.1283 24.6724 23.1892 5.9223 5.0448 7.1332 7.2065 3.6836 5.2969 3.4551 3.9658 3.6949 5.7128 11.8379 17.2091 23.8394 7.4131 15.9889 15.8806 11.6107 11.4444 16.9048 15.4603 15.8445 19.0973 7.0833 20.3783 27.4090 24.5607 10.7596 11.2546 22.4125 20.7593 41.3941 25.1101 25.6030 14.9392 25.5179 20.2588 29.1832 34.0544 28.6132 18.7583 26.1706 29.6687 22.6442 29.1025
temp: 298.150 k
press: 1.00000 atm
elementType: 16 16 16 16 16 15 15 8 8 8 8 6 6 6 6 6 6 6 6 6 6 6 6 1 1 1 1 1 1 1 1 1 1 1 1 1 1 1 1 1 1 1 1 1 1 1 1 1 1 1 1
symmnumber: 1
zpe: 1037799.6 jmol-1
zpe.correction: 0.395277 hartree
zpe.thermalcorrener: 0.431094 hartree
zpe.thermalcorrenthalpy: 0.432038 hartree
zpe.thermalcorrgfe: 0.319029 hartree
zpe.sumelectzpe: -3445.857321 hartree
zpe.sumelectthermal: -3445.821504 hartree
zpe.sumelectthermalent: -3445.820559 hartree
zpe.sumelectthermalfe: -3445.933569 hartree
dipole: 0.0768 0.2399 -3.4084
dipole: 3.4177
quadrupole: -161.8327 -173.8838 -204.4819
quadrupole: -8.5773 0.4901 0.3532
quadrupole: 18.2335 6.1823 -24.4157 -8.5773 0.4901 0.3532
hfenergy: -3446.2525976 hartree
pointgroup: C01 [X(C12H28O4P2S5)]
dipole: 0.0289184 -0.0308828 1.3439462 debye
polarizability: 463.9497779|32.0064129|296.0985162|2.0209818|-1.2803982|254.258147 unknown
InChI: InChI=1S/2C6H14O2PS.S3/c2*1-5(2)7-9(10)8-6(3)4;1-3-2/h2*5-6H,1-4H3;
charge 0 multiplicity 1
51 atoms
S  1.172292 1.494633 -0.749785
S  -1.179219 -1.303476 -0.802498
S  -0.007214 0.123023 -2.106605
S  4.105576 -0.570086 -2.072339
S  -4.260356 0.508021 -2.159182
P  3.104122 0.210738 -0.438008
P  -3.178878 -0.124993 -0.512107
O  3.983786 1.308461 0.587953
O  2.455357 -0.890611 0.719309
O  -2.592468 1.065836 0.586326
O  -3.96363 -1.230963 0.580053
C  5.136493 2.098804 0.019034
C  3.077822 -2.259061 0.88698
C  -3.295575 2.400705 0.697241
C  -5.032614 -2.16222 0.064707
C  5.945274 2.512033 1.251665
C  4.607543 3.280585 -0.804006
C  2.004796 -3.05436 1.633558
C  4.408748 -2.13734 1.639515
C  -2.269713 3.291693 1.400651
C  -4.613995 2.232087 1.462484
C  -5.819344 -2.552841 1.318971
C  -4.385301 -3.350613 -0.658803
H  5.720618 1.411775 -0.626124
H  3.241225 -2.67132 -0.128999
H  -3.488504 2.757277 -0.334399
H  -5.667802 -1.583759 -0.636205
H  6.845232 3.071706 0.937237
H  6.263213 1.625707 1.825928
H  5.341227 3.158845 1.911086
H  5.454238 3.890487 -1.169172
H  4.032886 2.935301 -1.68166
H  3.956978 3.922245 -0.184064
H  2.341154 -4.098773 1.768285
H  1.058128 -3.053304 1.068046
H  1.817624 -2.611945 2.627217
H  4.81865 -3.144479 1.839956
H  5.154585 -1.577476 1.047849
H  4.258148 -1.618564 2.601912
H  -2.66679 4.319655 1.488173
H  -1.325649 3.320925 0.831422
H  -2.054267 2.908167 2.412845
H  -5.084526 3.220322 1.619111
H  -5.325162 1.600994 0.900492
H  -4.428927 1.768305 2.446677
H  -6.657288 -3.218597 1.042365
H  -6.228688 -1.658588 1.818124
H  -5.167929 -3.085329 2.033296
H  -5.166068 -4.064443 -0.979583
H  -3.832294 -3.024052 -1.557429
H  -3.686415 -3.876535 0.0152
