program: Gaussian 09
title: 000081845
version: EM64L-G09RevD.01
frameworkgroup: C1[X(C10H5N3O3)]
method: RPBEPBE
basis: SDD
operation: Freq
keyword: #p
keyword: freq=noraman
keyword: PBEPBE/SDD
title: #p freq=noraman PBEPBE/SDD
converged: NO YES NO NO
title: Mulliken charges:
elementType: O O O N N N C C C C C C C C C C H H H H H
charge: -0.161855 -0.161895 -0.164105 0.067296 0.067289 0.062784 0.121903 0.339192 0.339112 -0.592076 -0.592079 0.509607 -0.775210 -0.114752 -0.114738 -0.117428 0.275717 0.275673 0.241015 0.253565 0.240986
chargesum: 0.00000
title: Mulliken charges with hydrogens summed into heavy atoms:
elementType: O O O N N N C C C C C C C C C C
charge: -0.161855 -0.161895 -0.164105 0.067296 0.067289 0.062784 0.121903 0.339192 0.339112 -0.316359 -0.316407 0.509607 -0.039644 -0.114752 -0.114738 -0.117428
polarizability: 2.17361076e+02 2.79917593e-02 2.08147543e+02 -7.81882234e-01 1.27376417e-02 5.35653332e+01
1716.lowfreq: -75.7182 -53.9817 -32.7528 -31.9860 -4.9441 -2.3505 -0.0002 0.0001 0.0002
frequency: -75.7179 -53.9720 -32.7528 -31.9621 43.2312 61.1923 79.4286 143.6978 243.9958 247.8871 292.5360 314.1320 316.5468 344.0667 370.5196 373.9881 443.0514 474.4333 475.7921 478.7987 484.3918 486.8971 490.6524 597.0643 598.7369 621.3335 720.5283 732.8535 839.2860 881.6210 883.1106 902.3057 1011.2442 1037.3505 1077.8093 1144.2319 1213.0171 1214.4184 1346.5265 1369.1693 1401.9391 1409.0080 1466.3819 1469.5606 1505.3050 1521.5191 1537.4361 1577.9046 1612.0027 2384.4450 2386.7757 2408.7703 2983.7127 3069.0872 3106.1022 3179.8224 3182.2798
redmass: 1.4256 3.2279 13.9642 8.4708 10.9059 5.6430 8.9564 5.5262 12.1596 4.7947 6.7127 12.5616 3.6817 4.2766 6.9391 13.1178 6.8935 12.4954 12.5977 12.5223 12.6057 12.6179 11.9937 4.5378 4.7068 4.1695 4.4507 2.6660 5.6777 1.4269 9.1372 1.8857 1.6192 1.5214 2.2193 8.3598 2.7566 1.5855 4.4822 4.6519 1.2408 3.5499 1.1211 1.0968 8.9578 9.2829 11.9832 7.1894 6.7027 12.7414 12.7403 12.7450 1.0421 1.0913 1.0996 1.0932 1.0941
irintensity: 0.7367 0.5382 0.3275 0.0101 1.9704 0.0030 0.0041 0.5238 0.2698 0.0001 0.4653 1.7061 4.3351 2.7872 3.3874 0.1947 5.3409 0.0855 21.7187 20.7318 2.3818 21.3585 19.5126 0.0067 0.0862 6.9434 15.0540 3.7714 65.8697 0.0051 85.0436 69.1062 96.6530 5.4050 19.6268 3.5831 3.6881 3.6326 29.6894 6.8996 1.4664 83.6654 1.6882 22.7209 22.1599 0.3269 0.2288 170.8533 160.5190 2658.3911 2498.8535 51.6392 14.1344 13.9798 8.6302 0.2333 0.3680
temp: 298.150 k
press: 1.00000 atm
elementType: 8 8 8 7 7 7 6 6 6 6 6 6 6 6 6 6 1 1 1 1 1
symmnumber: 1
zpe: 350254.0 jmol-1
zpe.correction: 0.133405 hartree
zpe.thermalcorrener: 0.145407 hartree
zpe.thermalcorrenthalpy: 0.146351 hartree
zpe.thermalcorrgfe: 0.093721 hartree
zpe.sumelectzpe: -772.904110 hartree
zpe.sumelectthermal: -772.892107 hartree
zpe.sumelectthermalent: -772.891163 hartree
zpe.sumelectthermalfe: -772.943794 hartree
dipole: -0.8631 -0.0040 -0.0006
dipole: 0.8631
quadrupole: -109.7900 -112.9384 -88.6149
quadrupole: -0.0587 0.0234 -0.0066
quadrupole: -6.0089 -9.1573 15.1662 -0.0587 0.0234 -0.0066
hfenergy: -773.0375145 hartree
pointgroup: C01 [X(C10H5N3O3)]
dipole: -0.3395564 -0.0018289 -0.0023168 debye
dipolederiv: -0.6507585 0.7767088 0.0084243 0.738663 -1.6889711 -0.0152198 0.0127562 -0.0251783 -0.2609916 -0.6622859 -0.7881911 0.008512 -0.7428766 -1.6774495 0.0150065 0.013048 0.0253904 -0.2610179 -2.170095 0.0054187 -0.0159462 -0.0012131 -0.2580644 -0.0000129 -0.0228988 0.0000586 -0.2660752 -0.784847 0.8921625 0.0084448 0.9076431 -2.0457667 -0.0137569 0.0123204 -0.0354712 -0.1933994 -0.7959574 -0.8993288 0.0086658 -0.9158755 -2.0347659 0.0142514 0.0123186 0.0352138 -0.1934018 -2.6214416 0.0050114 -0.0196246 0.0059309 -0.3119854 0.0001307 -0.0291115 0.0001707 -0.2046287 0.1994023 -0.0025166 -0.0064246 -0.002367 -0.5864391 0.0002019 -0.0545145 0.0004076 -0.0903226 0.5333985 -0.4444118 -0.0052444 -0.5776913 1.3976865 0.0067368 -0.0024167 0.0191563 0.1312415 0.539438 0.4495947 -0.0056363 0.5826858 1.3917579 -0.0078738 -0.0028106 -0.0200422 0.1312972 -0.4534518 0.111728 -0.0010165 0.1673208 -0.2478291 -0.002574 0.0028948 -0.0023339 -0.207608 -0.4549683 -0.1106608 -0.0008517 -0.1664503 -0.246322 0.0023518 0.0031428 0.0021734 -0.2075564 1.7281074 -0.0037703 0.0139403 -0.0036298 0.3163543 -0.0001892 0.0141544 -0.0002123 0.1478892 -0.1769611 0.0006264 0.0031838 0.0008559 0.024024 0.0000147 0.1002567 -0.0002399 0.0708804 0.9933593 -1.3170922 -0.0203036 -1.2685922 2.7840915 0.0308527 -0.0285777 0.0545081 0.3173129 1.0117422 1.3327452 -0.0202084 1.2780873 2.7658021 -0.0301182 -0.0286437 -0.0538761 0.3173301 3.5613897 -0.0077565 0.0290647 -0.0020864 0.3291381 -0.0000256 0.0389276 -0.0000857 0.3338638 0.064468 -0.0540203 -0.0022255 -0.0565085 0.0074426 -0.0005824 -0.0012587 -0.0016501 0.1833134 0.065019 0.0537117 -0.0022954 0.0562068 0.0067616 0.000877 -0.0013802 0.0019394 0.1832764 0.0428179 -0.0404338 -0.0108829 -0.0825662 -0.0248611 -0.0953835 -0.0576567 -0.0656798 0.0695015 -0.0117754 0.0004539 0.0408168 0.0005057 0.124495 -0.0004254 0.076927 -0.0004935 -0.0699627 0.0433996 0.0400209 -0.0103924 0.0819576 -0.0250993 0.0957383 -0.0574774 0.0662446 0.0690579 unknown
polarizability: 217.3644625|0.0347083|208.1475786|0.2218017|-0.0421322|53.5619117 unknown
InChI: InChI=1S/C10H5N3O3/c1-7-9(12-5-15)2-8(11-4-14)3-10(7)13-6-16/h2-3H,1H3
charge 0 multiplicity 1
21 atoms
O  -2.357256 4.560635 -0.103697
O  -2.386411 -4.545953 -0.101767
O  5.401787 -0.011977 -0.08137
N  -1.194172 2.429846 -0.148786
N  -1.20769 -2.423739 -0.145632
N  2.974382 -0.008915 -0.111199
C  -1.27819 0.003343 -0.165454
C  -0.527723 1.217625 -0.150272
C  -0.534657 -1.215162 -0.148608
C  0.888992 1.222804 -0.13357
C  0.881992 -1.228286 -0.131611
C  1.59317 -0.004756 -0.126419
C  -2.789612 0.0077 -0.177671
C  -1.774753 3.488443 -0.124253
C  -1.793902 -3.479251 -0.122109
C  4.181592 -0.012549 -0.09632
H  1.432111 2.171114 -0.125662
H  1.419717 -2.17965 -0.122054
H  -3.188781 -0.885274 -0.686091
H  -3.19859 0.010321 0.8516
H  -3.183607 0.901581 -0.688555
