program: Gaussian 09
title: 000081944
version: EM64L-G09RevD.01
frameworkgroup: C1[X(C13H28NO4P)]
method: RPBEPBE
basis: SDD
operation: Freq
keyword: #p
keyword: freq=noraman
keyword: PBEPBE/SDD
title: #p freq=noraman PBEPBE/SDD
converged: YES YES NO NO
title: Mulliken charges:
elementType: P O O O O N C C C C C C C C C C C C C H H H H H H H H H H H H H H H H H H H H H H H H H H H H
charge: 1.197596 -0.522825 -0.493156 -0.622908 -0.197231 -0.072683 -0.099814 -0.258755 -0.261904 -0.350330 -0.351188 -0.372841 -0.353601 -0.348466 -0.348504 -0.642993 -0.654571 -0.683457 -0.682975 0.234061 0.207025 0.204309 0.226113 0.214980 0.205277 0.204583 0.211565 0.276680 0.217656 0.256763 0.218654 0.197848 0.193734 0.194359 0.196873 0.200589 0.273819 0.220210 0.211577 0.248041 0.223215 0.213520 0.210926 0.216651 0.211027 0.212995 0.217554
chargesum: 0.00000
title: Mulliken charges with hydrogens summed into heavy atoms:
elementType: P O O O O N C C C C C C C C C C C C C
charge: 1.197596 -0.522825 -0.493156 -0.622908 -0.197231 -0.072683 -0.099814 0.182331 0.168518 0.069927 0.064960 0.121495 0.121817 0.043116 0.042727 0.051625 0.028262 -0.042361 -0.041399
polarizability: 2.20700984e+02 -7.04559092e+00 1.89837872e+02 3.93856307e-01 6.08886805e+00 1.70820266e+02
1716.lowfreq: -33.7096 -12.8233 -9.3040 -6.9449 0.0012 0.0017 0.0022 3.3373 16.5792
frequency: -32.9911 -11.2707 15.5660 18.2719 26.0044 39.6857 53.9808 61.9190 75.7579 89.2291 95.2438 100.2980 109.2012 111.0531 125.9968 138.7859 152.2749 179.4320 189.2666 195.5243 204.6516 218.2947 228.6768 234.0490 242.7495 275.0780 296.5147 317.7220 347.0486 362.7277 386.5151 411.2756 427.0894 454.0094 477.3108 512.7572 617.6254 627.9282 664.1897 708.6168 740.2577 740.6297 774.1871 786.6931 798.6089 801.3254 834.9177 897.8582 898.2347 926.9083 930.7391 931.3197 935.9547 944.2872 1004.5804 1020.0506 1037.5453 1038.6971 1072.4859 1079.7299 1080.7913 1081.7741 1101.9043 1113.0541 1117.4898 1118.0431 1143.2567 1143.6066 1198.7129 1209.3892 1210.8253 1236.4331 1268.5968 1270.1243 1272.0793 1275.6371 1282.2887 1283.7694 1292.5489 1336.9144 1341.9722 1342.7732 1349.7690 1368.1119 1369.8732 1385.2412 1389.5163 1389.7140 1391.4896 1393.5906 1458.4800 1465.5344 1466.9766 1468.1522 1469.2029 1472.7043 1473.4050 1476.0695 1477.0537 1481.4145 1482.4392 1483.0604 1483.9929 1490.1873 1491.0650 1497.2888 1624.9456 2962.4078 2968.8658 2969.0335 2975.3865 2975.8839 2981.2117 2988.4653 2988.7252 2994.6489 2996.7442 3001.8162 3012.4262 3013.1682 3016.6769 3030.9920 3039.4829 3062.1495 3063.0452 3066.3386 3072.9978 3075.2542 3075.5916 3075.8773 3076.8664 3084.8812 3088.1612 3104.2756 3108.6367
redmass: 1.8333 2.8184 3.4588 3.7553 1.9476 3.8990 4.1778 2.7659 4.4722 2.8843 2.2311 2.5333 2.8386 1.9796 4.0929 3.2915 4.4065 4.1266 2.4414 3.2340 1.1658 2.1952 1.1404 1.1278 4.4101 2.8886 4.4716 3.1409 3.6695 4.6183 3.5091 4.6972 3.0492 3.8520 4.7371 4.7134 6.9989 5.1988 8.3578 11.8921 1.0711 1.0719 1.3604 1.1859 1.1318 1.1306 2.1935 1.8512 1.8041 7.2803 1.1594 1.1719 6.2278 2.2878 2.6261 12.4582 3.5749 3.6748 2.1649 2.2436 2.2494 1.9233 1.8197 2.1097 2.4823 2.5346 1.4360 1.4452 2.9761 1.3737 1.3714 1.6317 1.2598 1.2793 1.1681 1.1768 1.0817 1.0797 1.2386 1.2505 1.4399 1.4225 1.2809 1.4107 1.3922 1.4440 1.2143 1.2179 1.5977 1.2268 1.0779 1.0465 1.0765 1.0737 1.0489 1.0655 1.0635 1.0424 1.0451 1.0642 1.0545 1.0617 1.0629 1.0892 1.0891 1.0917 8.4752 1.0594 1.0583 1.0586 1.0368 1.0365 1.0578 1.0360 1.0356 1.0594 1.0594 1.0636 1.1002 1.1000 1.0606 1.1019 1.1039 1.1046 1.0997 1.1048 1.1017 1.1011 1.1004 1.0995 1.1031 1.0991 1.1000 1.1027 1.1016
irintensity: 0.1693 0.2244 2.7956 0.8986 0.9487 1.0211 0.3089 0.4134 0.4002 0.2794 0.6031 0.0373 0.5334 0.8345 3.2787 2.4791 5.8234 7.6457 1.8277 11.9755 5.9905 11.6057 0.1562 0.3206 5.1241 7.3183 4.4860 0.4643 7.6486 18.2964 8.2197 19.7439 0.7009 18.0824 37.8637 24.8359 29.1602 9.2369 88.2850 171.8749 8.1689 9.2780 13.0631 7.2600 0.7458 1.6348 15.7850 31.9872 25.4509 209.7467 1.6053 2.5594 231.7355 15.4232 3.7115 118.2351 31.6728 10.7254 17.6089 4.9487 3.4880 9.2463 14.3772 54.2836 2.6425 9.3992 1.2826 2.3563 46.0279 0.1161 0.0904 51.6053 3.4011 2.1417 1.0042 1.7584 0.1243 0.1231 16.7270 2.9289 0.1008 0.0468 8.4105 18.0227 20.6584 42.2785 6.1977 6.6255 22.1194 41.1187 17.1509 7.5561 0.7226 0.5622 10.9451 1.2480 0.3864 12.5815 12.5764 4.9379 11.2214 10.8995 8.3201 31.7067 3.6267 14.6289 221.3367 12.6521 16.9583 49.7048 36.0683 32.6342 33.5378 27.4175 22.5483 34.8414 44.7812 27.6220 8.6808 8.7181 29.9715 5.0040 0.8296 11.7895 4.1388 2.0051 4.5343 81.9412 77.7564 40.8067 129.1143 36.5176 33.2798 21.9929 18.4850
temp: 298.150 k
press: 1.00000 atm
elementType: 15 8 8 8 8 7 6 6 6 6 6 6 6 6 6 6 6 6 6 1 1 1 1 1 1 1 1 1 1 1 1 1 1 1 1 1 1 1 1 1 1 1 1 1 1 1 1
symmnumber: 1
zpe: 1051987.7 jmol-1
zpe.correction: 0.400681 hartree
zpe.thermalcorrener: 0.425277 hartree
zpe.thermalcorrenthalpy: 0.426221 hartree
zpe.thermalcorrgfe: 0.342796 hartree
zpe.sumelectzpe: -1207.470535 hartree
zpe.sumelectthermal: -1207.445938 hartree
zpe.sumelectthermalent: -1207.444994 hartree
zpe.sumelectthermalfe: -1207.528419 hartree
dipole: 2.5209 1.0290 1.0122
dipole: 2.9049
quadrupole: -101.3122 -118.2322 -138.6784
quadrupole: -7.0986 2.3657 -0.6740
quadrupole: 18.0954 1.1754 -19.2708 -7.0986 2.3657 -0.6740
hfenergy: -1207.8712155 hartree
pointgroup: C01 [X(C13H28N1O4P1)]
dipole: -0.886437 -0.5956534 0.4069187 debye
polarizability: 222.2307318|-0.1440103|188.1090231|0.9327031|-6.3141432|171.0193665 unknown
InChI: InChI=1S/C13H28NO4P/c1-5-9-11-17-19(16,18-12-10-6-2)13(15)14(7-3)8-4/h5-12H2,1-4H3
charge 0 multiplicity 1
47 atoms
P  0.023939 0.496182 -0.755232
O  1.500802 0.596855 0.143993
O  -0.184825 -1.21226 -1.101637
O  0.001473 1.339451 -2.110911
O  -0.870841 0.93976 1.859831
N  -2.566455 1.035658 0.249748
C  -1.269827 0.869485 0.667205
C  2.741516 0.980119 -0.593956
C  0.003524 -2.188991 0.009568
C  3.813818 1.217606 0.469749
C  -0.139533 -3.584014 -0.601498
C  -3.050169 0.900591 -1.151824
C  -3.58066 1.354119 1.295057
C  5.166336 1.634996 -0.156454
C  0.03139 -4.698508 0.458907
C  -3.17306 2.252597 -1.881779
C  -4.170807 0.083504 1.940584
C  6.255777 1.871851 0.911857
C  -0.109298 -6.111338 -0.147656
H  2.54279 1.889297 -1.192515
H  3.023879 0.158946 -1.281932
H  -0.763318 -2.014948 0.793003
H  1.003545 -2.040672 0.46041
H  3.458953 2.00187 1.164941
H  3.94301 0.294028 1.066079
H  -1.133274 -3.669142 -1.081825
H  0.615682 -3.703373 -1.401599
H  -2.374278 0.234368 -1.71527
H  -4.030447 0.389321 -1.101731
H  -3.090319 1.973858 2.06495
H  -4.372621 1.956459 0.814961
H  5.027966 2.558394 -0.754568
H  5.506231 0.851428 -0.863989
H  -0.721206 -4.564286 1.262434
H  1.024792 -4.60013 0.941644
H  -3.806832 2.963832 -1.32122
H  -2.172035 2.689475 -2.031147
H  -3.629338 2.096847 -2.876224
H  -4.646156 -0.569593 1.186406
H  -3.379296 -0.487132 2.455139
H  -4.938065 0.359224 2.686556
H  5.954136 2.671869 1.613449
H  6.434969 0.955572 1.504968
H  7.214652 2.169861 0.449837
H  -1.104388 -6.246214 -0.611592
H  0.651925 -6.28354 -0.931361
H  0.014442 -6.894283 0.622643
