program: Gaussian 09
title: 000081836
version: EM64L-G09RevD.01
frameworkgroup: C1[X(C8H9NO2)]
method: RPBEPBE
basis: SDD
operation: Freq
keyword: #pfreq=noraman
keyword: PBEPBE/SDD
title: #p freq=noraman PBEPBE/SDD
converged: NO YES NO NO
title: Mulliken charges:
elementType: O O N C C C C C C C C H H H H H H H H H
charge: -0.208048 -0.208479 0.018562 0.533619 -0.528016 -0.524906 -0.403777 0.383788 -0.668910 -0.186102 -0.373537 0.219278 0.213048 0.290643 0.242971 0.221734 0.224720 0.227716 0.237875 0.287819
chargesum: 0.00000
title: Mulliken charges with hydrogens summed into heavy atoms:
elementType: O O N C C C C C C C C
charge: -0.208048 -0.208479 0.018562 0.533619 -0.095690 -0.234263 -0.160806 0.383788 0.005261 0.051773 -0.085718
polarizability: 1.38451426e+02 9.53223322e-01 1.13433662e+02 -6.03046457e+00 5.32278384e+00 5.25456304e+01
1716.lowfreq: -16.9696 -6.6006 -0.0004 0.0002 0.0006 6.0111 14.7999 59.3730 125.3049
frequency: -8.3407 59.2932 125.3028 171.0950 183.5426 234.0980 301.6774 349.3890 388.4034 425.5997 482.3501 524.7862 565.6537 655.5780 692.4276 705.9317 742.5825 786.4538 818.5822 861.0205 928.0367 954.3852 979.8508 989.8674 999.2157 1047.9388 1064.4071 1089.2151 1099.3893 1176.1532 1208.0352 1229.0834 1242.0241 1297.9994 1313.3024 1367.5573 1390.2288 1398.6667 1435.9062 1471.4692 1472.4568 1482.3719 1491.5838 1588.9428 1616.9935 2983.2950 2994.8308 3046.5870 3084.3063 3087.2192 3130.0128 3157.2722 3164.8823 3188.2870
redmass: 2.5923 10.4716 3.6139 4.6150 2.0648 1.5278 3.5162 3.0854 5.8002 3.2971 4.8288 5.9284 4.3098 7.5243 2.2242 5.5391 7.2706 1.1732 1.4828 4.0343 1.4249 1.3925 2.3906 6.1338 1.3522 1.5906 1.9722 2.0639 1.3976 1.1370 4.1512 3.3467 1.2765 1.2836 1.5107 10.8857 1.1995 6.4013 2.7402 1.1281 1.2322 1.7033 1.1192 6.5164 6.9891 1.0348 1.0603 1.1018 1.1003 1.1014 1.0890 1.0935 1.0922 1.0961
irintensity: 0.3500 0.0281 0.1595 1.5450 1.1543 0.6474 0.1649 0.6663 0.5443 0.6515 1.7183 1.7031 4.5456 7.0227 24.9735 19.7727 22.1370 4.0803 36.3620 3.5666 7.2012 10.8463 1.8915 0.1516 1.0272 7.0847 15.1600 18.2848 18.3443 9.8221 133.5266 134.7390 2.6599 0.0799 1.3010 119.1007 9.5580 2.7136 11.0020 13.7458 8.8751 27.0974 17.8824 4.0894 7.2813 31.4181 29.3808 4.2801 48.3869 37.0903 8.8731 13.3619 3.2073 4.0700
temp: 298.150 k
press: 1.00000 atm
elementType: 8 8 7 6 6 6 6 6 6 6 6 1 1 1 1 1 1 1 1 1
symmnumber: 1
zpe: 408199.0 jmol-1
zpe.correction: 0.155475 hartree
zpe.thermalcorrener: 0.164658 hartree
zpe.thermalcorrenthalpy: 0.165602 hartree
zpe.thermalcorrgfe: 0.120617 hartree
zpe.sumelectzpe: -514.564689 hartree
zpe.sumelectthermal: -514.555506 hartree
zpe.sumelectthermalent: -514.554562 hartree
zpe.sumelectthermalfe: -514.599547 hartree
dipole: 5.2011 2.2645 -0.1925
dipole: 5.6759
quadrupole: -71.9410 -61.2340 -65.8447
quadrupole: -5.0692 -0.3382 0.6705
quadrupole: -5.6011 5.1059 0.4952 -5.0692 -0.3382 0.6705
hfenergy: -514.720164 hartree
pointgroup: C01 [X(C8H9N1O2)]
dipole: -2.0779845 0.8151887 0.0640958 debye
dipolederiv: -0.8866517 -0.115172 0.0810527 -0.0796286 -0.4983988 0.0469273 0.0889847 0.0498775 -0.2461022 -0.5507797 0.1264635 0.0141004 0.1366092 -0.8109546 0.0703198 0.0192394 0.0636303 -0.2393679 1.602811 -0.2290397 -0.1167706 -0.2982174 1.1733612 -0.1115521 -0.1273825 -0.1052545 0.2149684 0.2782178 0.3061999 -0.0250105 0.3376095 -0.0541147 -0.0057775 -0.0384802 -0.0174239 -0.0718396 0.0221869 -0.0774767 -0.0309533 -0.080102 0.0764515 -0.0186596 -0.1563205 -0.0794237 0.0862846 -0.0131455 -0.2720399 0.0041858 0.0787219 -0.0529794 -0.0190221 -0.0267822 0.03073 -0.1163328 0.0647328 -0.078003 -0.0273877 -0.1577067 0.0118214 -0.0185964 0.0017667 -0.0160807 -0.1254313 -0.4488568 0.2706822 0.020277 0.2932139 -0.0491804 -0.0163468 0.0202033 -0.0167599 0.072509 0.0047552 -0.0371982 -0.0260087 -0.0412208 0.0582208 -0.0239232 0.0764528 0.0289321 0.0125155 -0.2205955 -0.0269555 0.0099256 -0.0210055 0.1818503 -0.0327995 0.010184 -0.0378224 -0.1254667 0.0152681 0.0391423 -0.0316137 -0.2439008 -0.0435514 0.00721 0.0145019 -0.0152649 -0.1240164 0.0244859 0.0424704 -0.0629567 -0.017037 -0.0550761 0.1162583 -0.0132908 0.0828699 -0.0142246 -0.051892 0.0292205 0.0802275 0.081135 -0.0155328 -0.1054337 0.0659846 -0.0503337 0.002395 0.1445609 0.0051508 0.0099986 -0.0222411 0.0242987 0.019954 0.0100792 0.0182382 0.1525129 -0.0661841 0.0846249 0.0182131 0.0702382 0.0744258 0.0072359 0.0191976 0.0021573 0.1387192 0.0976216 0.0195305 -0.0380873 0.0656094 -0.0659297 0.1245275 -0.0323654 0.0680608 -0.0121381 -0.1469624 -0.1527761 0.0062349 -0.1640283 0.0141877 0.0017077 -0.0028845 0.0003621 0.0640866 -0.0036089 0.1153904 0.0849917 0.0767163 0.0239144 -0.0826411 0.043131 -0.0539481 0.0094685 0.0753925 0.0098244 0.0074485 0.0127291 -0.0995957 0.0283556 0.009724 0.0314483 0.1494512 0.0586439 -0.0600387 0.0221326 -0.0274944 0.1067818 0.012256 0.0180567 0.0160056 0.1720085 unknown
polarizability: 138.5260853|-0.0409527|113.3326069|-5.5392609|-5.8866992|52.5720263 unknown
InChI: InChI=1S/C8H9NO2/c1-2-7-4-3-5-8(6-7)9(10)11/h3-6H,2H2,1H3
charge 0 multiplicity 1
20 atoms
O  3.315944 0.121215 -0.259939
O  2.275831 -1.870751 0.13089
N  2.259648 -0.58964 -0.039536
C  -1.469166 -0.011426 0.322465
C  -2.744212 -0.814348 0.532523
C  -0.211877 -0.656497 0.261423
C  -1.514408 1.397061 0.141038
C  0.950042 0.106336 0.019782
C  -3.365192 -1.284838 -0.81042
C  -0.339408 2.145965 -0.098973
C  0.91446 1.50551 -0.163565
H  -2.531832 -1.699304 1.161037
H  -3.486488 -0.202465 1.079169
H  -0.118135 -1.737951 0.400326
H  -2.481994 1.910701 0.193398
H  -3.618151 -0.423091 -1.454184
H  -4.289039 -1.863584 -0.630856
H  -2.65988 -1.926477 -1.36841
H  -0.400262 3.231035 -0.231753
H  1.842919 2.052648 -0.344617
