program: Gaussian 09
title: 000000152
version: EM64L-G09RevD.01
frameworkgroup: C1[X(C7H15N2O8P)]
method: RPBEPBE
basis: SDD
operation: Freq
keyword: #p
keyword: freq=noraman
keyword: PBEPBE/SDD
title: #p freq=noraman PBEPBE/SDD
converged: YES YES NO NO
title: Mulliken charges:
elementType: P O O O O O O O O N N C C C C C C C H H H H H H H H H H H H H H H
charge: 1.371365 -0.416831 -0.464664 -0.465230 -0.502732 -0.327294 -0.703242 -0.664645 -0.595210 -0.377660 -0.521188 -0.143984 0.002915 -0.182970 0.001722 -0.366033 0.274203 -0.513574 0.254300 0.263220 0.241410 0.277876 0.282840 0.252217 0.343585 0.386642 0.393694 0.257302 0.230909 0.279627 0.296143 0.439918 0.395371
chargesum: 0.00000
title: Mulliken charges with hydrogens summed into heavy atoms:
elementType: P O O O O O O O O N N C C C C C C C
charge: 1.371365 -0.416831 -0.078023 -0.071536 -0.502732 -0.327294 -0.263324 -0.269275 -0.595210 -0.034075 0.054581 0.110316 0.266135 0.058439 0.279599 0.169023 0.274203 -0.025363
polarizability: 1.75435248e+02 -3.32700576e+00 1.35559854e+02 -4.95965576e+00 4.57319111e+00 1.05538396e+02
1716.lowfreq: -6.2442 -0.0015 -0.0015 -0.0011 7.2171 9.6831 17.8496 33.7484 41.2949
frequency: 17.5383 33.6171 41.1869 55.3891 64.4770 84.4309 93.3245 125.7035 147.2230 165.0796 188.5233 198.0001 231.1337 238.0336 255.2888 262.6874 279.9051 306.7148 314.4973 324.4317 347.9126 357.0533 374.7946 399.4502 443.3951 457.6434 488.1787 542.8627 552.0622 576.1312 589.6425 612.2952 641.7680 685.8220 703.7538 722.4785 750.8931 764.0412 780.3185 786.6807 796.3480 858.9491 887.5357 910.1877 929.3238 957.1330 993.5919 1007.3132 1010.9843 1042.1411 1067.6604 1085.8998 1093.8174 1103.7811 1120.4778 1140.3014 1161.9408 1181.9467 1213.0386 1221.1835 1244.5485 1268.4387 1271.6501 1308.2945 1311.7447 1314.1426 1324.7154 1340.2762 1340.5398 1352.9516 1363.5356 1379.6530 1406.7324 1435.6899 1448.3833 1472.1055 1587.8249 1660.4838 2901.8249 2981.4905 2988.5710 2998.3072 3008.4299 3032.5573 3038.5477 3050.7987 3103.5829 3198.9927 3440.4426 3469.2461 3528.4034 3589.5487 3594.5348
redmass: 8.9660 4.6264 3.2345 5.3624 6.0673 4.4091 7.5482 4.6770 3.6802 5.6656 7.1998 3.9906 1.5378 2.9648 3.3712 3.5533 3.2153 4.8235 3.4440 3.3600 5.0151 9.5693 8.4536 4.3829 4.2977 3.2315 2.3825 1.3968 1.5588 2.1848 4.6244 8.0345 1.6518 4.2008 9.1092 3.9852 2.9663 4.0567 1.4271 1.0897 7.3969 3.4769 1.6016 5.7656 3.0248 3.5594 3.2218 5.2954 1.4509 4.1154 4.2083 4.5575 4.1701 3.9000 2.6708 1.7375 2.1349 1.2692 1.1084 1.5301 1.1810 1.2946 1.1947 1.1871 1.1842 1.2418 1.3086 1.1211 1.2474 1.3373 1.3765 1.7239 1.4626 1.0994 1.0777 2.2762 5.5567 1.0834 1.0719 1.0606 1.0839 1.0859 1.0873 1.0593 1.1014 1.0868 1.1072 1.0663 1.0645 1.0457 1.0781 1.0971 1.0661
irintensity: 1.9342 0.6835 2.1065 3.6554 4.3824 1.3362 3.2171 3.2307 5.1142 21.7200 3.4506 6.8884 47.0110 45.3385 20.8816 18.2093 84.0453 12.4280 28.1588 66.8580 0.5681 17.9002 46.9493 21.5199 4.1829 24.6251 26.2488 150.7655 31.0078 20.4330 58.9411 38.2731 220.0281 70.3653 157.3170 184.8184 66.9627 10.8856 59.4724 144.5190 251.9954 12.4465 8.9253 50.6797 12.5710 135.5103 53.7894 55.3643 5.5063 43.8186 63.9024 24.3051 265.6854 29.4338 0.9157 5.4204 18.9600 32.5221 5.3462 18.7891 18.7714 3.7819 25.5608 5.9451 26.1024 5.0598 22.3097 79.3918 14.2273 49.5940 17.5563 42.0026 165.4394 13.1784 12.1852 253.6416 100.2861 38.1381 1630.0442 24.9367 3.2978 11.5224 56.5568 13.2590 15.0122 24.6271 5.9794 439.2409 51.3638 4.5636 40.5887 5.5736 68.0689
temp: 298.150 k
press: 1.00000 atm
elementType: 15 8 8 8 8 8 8 8 8 7 7 6 6 6 6 6 6 6 1 1 1 1 1 1 1 1 1 1 1 1 1 1 1
symmnumber: 1
zpe: 649242.7 jmol-1
zpe.correction: 0.247283 hartree
zpe.thermalcorrener: 0.267272 hartree
zpe.thermalcorrenthalpy: 0.268217 hartree
zpe.thermalcorrgfe: 0.197076 hartree
zpe.sumelectzpe: -1326.806239 hartree
zpe.sumelectthermal: -1326.786250 hartree
zpe.sumelectthermalent: -1326.785306 hartree
zpe.sumelectthermalfe: -1326.856446 hartree
dipole: -4.6638 2.2203 -1.2972
dipole: 5.3257
quadrupole: -125.4058 -125.4171 -113.3249
quadrupole: 16.0909 11.2843 -5.5828
quadrupole: -4.0232 -4.0345 8.0577 16.0909 11.2843 -5.5828
hfenergy: -1327.0535224 hartree
pointgroup: C01 [X(C7H15N2O8P1)]
dipole: -1.8498743 -0.8445628 0.5049704 debye
polarizability: 174.8865976|3.9400243|136.1599558|7.4636615|2.3134982|105.4869444 unknown
InChI: InChI=1S/C7H15N2O8P/c8-1-4(10)9-7-6(12)5(11)3(17-7)2-16-18(13,14)15/h3,5-7,9,11-14H,1-2,8H2
charge 0 multiplicity 1
33 atoms
P  3.799647 1.090706 0.12855
O  0.444459 0.123741 0.508482
O  0.498098 -2.914498 -0.351027
O  -2.094798 -2.412284 -0.170832
O  3.365095 -0.232955 1.191047
O  -3.610774 -0.242295 -0.633731
O  2.332439 1.541388 -0.571272
O  4.547759 0.319784 -1.22554
O  4.690199 2.165243 0.866486
N  -1.746129 0.902773 0.127053
N  -5.324708 2.004243 -0.074296
C  0.087716 -2.250547 0.88113
C  1.055319 -1.09366 1.190543
C  -1.273453 -1.549064 0.646465
C  -0.848332 -0.241751 -0.084715
C  2.484475 -1.312471 0.687767
C  -3.072585 0.845841 -0.227696
C  -3.877518 2.166307 -0.141218
H  0.039342 -2.97115 1.720041
H  1.071816 -0.855288 2.26892
H  -1.755755 -1.2878 1.610179
H  -0.723738 -0.446239 -1.167744
H  2.514685 -1.399992 -0.411987
H  2.87949 -2.246408 1.122067
H  -1.321257 1.769015 0.469093
H  -0.343935 -3.249279 -0.771942
H  -2.85531 -1.833878 -0.504521
H  -3.621708 2.764179 -1.038615
H  -3.528405 2.753586 0.730062
H  -5.660343 1.591807 0.801391
H  -5.717423 1.517163 -0.885781
H  1.505287 1.066685 -0.187991
H  5.536845 0.385399 -1.217869
