program: Gaussian 09
title: 000081816
version: EM64L-G09RevD.01
frameworkgroup: C1[X(C9H9NO4)]
method: RPBEPBE
basis: SDD
operation: Freq
keyword: #pfreq=noraman
keyword: PBEPBE/SDD
title: #p freq=noraman PBEPBE/SDD
converged: YES YES NO YES
title: Mulliken charges:
elementType: O O O O N C C C C C C C C C H H H H H H H H H
charge: -0.288240 -0.238288 -0.198476 -0.201028 0.020781 0.384511 0.216480 0.273886 -0.486240 -0.363752 -0.339038 -0.766254 0.178557 -0.499181 0.323338 0.244533 0.280069 0.257801 0.257837 0.214859 0.246597 0.234671 0.246577
chargesum: 0.00000
title: Mulliken charges with hydrogens summed into heavy atoms:
elementType: O O O O N C C C C C C C C C
charge: -0.288240 -0.238288 -0.198476 -0.201028 0.020781 0.384511 0.216480 0.273886 -0.162902 -0.119219 -0.058969 -0.035757 0.178557 0.228665
polarizability: 1.85279300e+02 -3.54343122e+00 1.34239333e+02 -1.17869045e-02 3.55117534e-03 5.58771359e+01
1716.lowfreq: -17.5116 -5.5258 -4.6661 0.0003 0.0006 0.0007 5.4494 47.4151 77.6301
frequency: -15.6106 47.4058 77.6266 93.3248 114.1173 141.9366 177.8173 226.4411 228.8779 296.2793 297.6520 310.5759 342.0810 379.4605 431.9996 467.0486 509.0322 539.9590 622.6662 659.2791 670.6206 723.2297 737.7172 750.3472 759.8090 847.7521 854.7008 947.4210 977.4548 996.9916 1005.6432 1040.7220 1058.7658 1090.3876 1115.7044 1150.2079 1159.4960 1196.3295 1213.1259 1239.0880 1282.0950 1353.3362 1372.7888 1405.3806 1414.1157 1425.3302 1450.9086 1452.4665 1463.6095 1469.0135 1491.0041 1563.7267 1621.2741 1631.9041 2997.8671 3007.1703 3081.5635 3101.2401 3109.3159 3146.4699 3153.3399 3180.7289 3183.2388
redmass: 10.2303 5.6809 2.0441 1.4412 5.2421 3.9706 4.7207 1.0568 6.5436 5.2013 4.2898 5.4227 5.7926 4.8919 3.4039 8.9137 4.2243 4.3758 6.3481 6.1362 8.3423 3.3750 7.2902 5.2557 8.4982 6.6556 1.3536 7.6222 1.4486 1.3627 1.4532 1.5785 2.8619 4.7235 1.2646 1.4901 1.3661 4.2030 3.3760 3.9596 1.5951 4.3136 5.2708 1.2774 5.0454 1.1887 1.0462 1.0489 1.0516 1.1456 3.1201 7.4403 7.0432 10.2898 1.0365 1.0296 1.0955 1.1016 1.1046 1.0899 1.1049 1.0922 1.0951
irintensity: 0.1255 0.5098 1.0445 0.0001 0.4072 0.1717 6.3519 1.8854 5.5425 11.6971 4.4844 3.0440 6.1235 0.4484 0.7147 4.3645 5.1040 0.7168 4.4433 11.1940 23.5696 19.5729 9.3445 3.5455 17.8910 0.0712 17.0300 17.2029 16.8347 0.0003 2.2411 11.4374 46.2555 172.6561 0.0175 64.1284 14.6833 309.0617 38.2774 171.1815 36.3635 54.5964 77.9107 15.1001 13.6538 30.5493 13.1815 15.5013 13.0168 13.2010 26.2124 8.6576 55.4835 178.6085 9.2795 35.6384 5.3783 26.7622 23.9046 10.2729 15.0935 3.5261 9.8094
temp: 298.150 k
press: 1.00000 atm
elementType: 8 8 8 8 7 6 6 6 6 6 6 6 6 6 1 1 1 1 1 1 1 1 1
symmnumber: 1
zpe: 441762.9 jmol-1
zpe.correction: 0.168259 hartree
zpe.thermalcorrener: 0.180718 hartree
zpe.thermalcorrenthalpy: 0.181662 hartree
zpe.thermalcorrgfe: 0.128858 hartree
zpe.sumelectzpe: -702.903529 hartree
zpe.sumelectthermal: -702.891070 hartree
zpe.sumelectthermalent: -702.890126 hartree
zpe.sumelectthermalfe: -702.942930 hartree
dipole: 3.2606 5.4483 -0.0003
dipole: 6.3495
quadrupole: -75.5117 -85.1895 -80.2985
quadrupole: -5.9285 0.0090 0.0006
quadrupole: 4.8215 -4.8563 0.0348 -5.9285 0.0090 0.0006
hfenergy: -703.0717881 hartree
pointgroup: C01 [X(C9H9N1O4)]
dipole: -1.3175543 2.1223567 0.000394 debye
dipolederiv: -1.5893532 0.1809461 -0.0002115 0.478724 -0.5754936 -0.0000465 -0.0010457 0.0002672 -0.2941898 -0.7725034 -0.2101508 0.0001723 -0.0834731 -0.8795908 0.0006468 0.0000173 -0.0004514 -0.315946 -0.489871 0.038255 0.0002188 0.0616817 -0.8730853 0.0002819 0.0002056 0.0000881 -0.2241524 -0.8816495 -0.0599708 0.0004834 0.0064794 -0.4821377 0.0000806 0.0006007 0.000231 -0.2123378 1.4201326 -0.2361798 -0.0009161 -0.346494 1.3492408 -0.0002958 -0.0009203 -0.0002998 0.1813953 0.435111 0.2797246 -0.0002007 -0.1186776 0.2045955 0.0000698 -0.0001897 -0.0001732 0.0307581 -0.4386734 0.2100635 0.0002616 0.1371142 -0.3277305 -0.0000131 0.0001891 -0.0000433 0.0225785 -0.5732984 -0.0324652 0.0000433 -0.0854005 -0.2944923 0.0000009 0.0003694 0.0000339 -0.0191631 0.2390739 -0.1584068 -0.0001425 -0.0568229 -0.0901206 -0.0000214 0.0000051 0.0002328 -0.0585374 -0.5371164 -0.0770368 0.0001614 0.1027126 0.1657954 -0.0000749 0.0001897 0.0000017 -0.1608136 0.1728857 -0.0026473 -0.000144 0.1534068 0.1672402 -0.0000794 0.0000887 0.0000709 -0.0704166 -0.2745975 -0.2220183 0.0001569 -0.014981 0.1448141 0.0000196 0.0002361 0.0001208 0.0129191 2.0783422 0.116622 -0.0001388 -0.2323109 1.1671955 -0.0006798 -0.0000701 -0.000101 0.2380914 0.7884753 -0.0128909 0.0001924 0.0641932 0.2193987 0.0000743 0.0003523 -0.0000285 0.2776419 0.1814537 -0.0068039 -0.0000014 -0.0170834 0.1039564 0.00001 0.0000301 0.0000079 0.1648821 0.0615092 -0.0520238 0.0000322 -0.0300228 -0.0889438 0.0000183 0.0000072 0.0000426 0.1473371 0.0629176 0.0700839 0.0000661 0.0784394 0.0773905 -0.0000225 0.0000627 -0.000032 0.1526522 0.0526346 0.0017451 -0.0622768 -0.0006307 0.058518 0.0612952 -0.0750747 0.0347118 -0.0006018 0.0528199 0.0016865 0.0622003 -0.0007042 0.0585666 -0.0612957 0.0749673 -0.0347104 -0.0006905 0.0826902 0.0925916 0.0000063 -0.0436856 -0.1681025 0.0000249 -0.0000047 -0.0000561 0.1067404 -0.0236933 0.0079328 0.0092953 -0.0922706 0.0490596 -0.0986997 -0.0441324 -0.079178 -0.0506778 -0.0235159 0.063179 -0.0000958 0.1322597 -0.0352346 0.0001322 -0.0001621 0.000111 0.1232993 -0.0237738 0.0077644 -0.0091627 -0.0924538 0.0491603 0.0985744 0.0442785 0.079154 -0.0507687 unknown
polarizability: 185.1503854|4.3724551|134.3682339|-0.0445804|-0.0065764|55.8771504 unknown
InChI: InChI=1S/C9H9NO4/c1-6-3-4-7(9(11)14-2)5-8(6)10(12)13/h3-5H,1-2H3
charge 0 multiplicity 1
23 atoms
O  -3.402608 0.485852 0.000797
O  -2.627539 -1.712982 0.000757
O  2.198296 -2.412344 -0.000201
O  3.719464 -0.725075 -0.002015
N  2.50199 -1.157581 -0.000668
C  1.62652 1.241474 -0.000428
C  1.386423 -0.1680 -0.000198
C  -1.036001 0.139158 0.001066
C  0.085401 -0.714421 0.000506
C  0.467602 2.066437 0.00015
C  -0.8377 1.543425 0.00085
C  2.985823 1.908261 -0.001183
C  -2.394211 -0.480952 0.00188
C  -4.788061 -0.040988 -0.000173
H  -0.049829 -1.799373 0.000676
H  0.60936 3.15238 0.000022
H  -1.706799 2.206504 0.00129
H  3.586376 1.610853 0.875741
H  3.585422 1.610817 -0.878739
H  2.866289 3.004437 -0.001125
H  -4.960081 -0.657021 -0.898562
H  -5.428116 0.8519 -0.000968
H  -4.961521 -0.656462 0.898324
