program: Gaussian 09
title: 000081844
version: EM64L-G09RevD.01
frameworkgroup: C1[X(C18H36O)]
method: RPBEPBE
basis: SDD
operation: Freq
keyword: #pfreq=noraman
keyword: PBEPBE/SDD
title: #p freq=noraman PBEPBE/SDD
converged: YES YES NO NO
title: Mulliken charges:
elementType: O C C C C C C C C C C C C C C C C C C H H H H H H H H H H H H H H H H H H H H H H H H H H H H H H H H H H H H
charge: -0.212168 -0.385992 -0.386725 -0.386692 -0.385525 -0.386017 -0.385254 -0.385360 -0.381661 -0.385646 -0.373146 -0.371681 -0.353133 -0.370773 -0.356886 -0.498391 -0.696730 0.217083 -0.771172 0.193656 0.193760 0.193275 0.193235 0.193183 0.193148 0.193376 0.193383 0.194094 0.194393 0.192792 0.192697 0.192396 0.192561 0.191813 0.191738 0.196502 0.195555 0.189070 0.189299 0.189079 0.187696 0.187505 0.187589 0.210972 0.222754 0.194628 0.194658 0.234199 0.227819 0.209643 0.209619 0.214739 0.239174 0.230531 0.255335
chargesum: 0.00000
title: Mulliken charges with hydrogens summed into heavy atoms:
elementType: O C C C C C C C C C C C C C C C C C C
charge: -0.212168 0.001425 -0.000215 -0.000360 0.001234 0.002470 0.000235 -0.000402 0.001890 0.006411 0.005223 0.005094 0.021961 0.062953 0.032400 -0.036373 -0.062728 0.217083 -0.046131
polarizability: 2.71259920e+02 2.42341372e+00 1.76177159e+02 -9.81976904e-01 -4.73206196e-01 1.56146711e+02
1716.lowfreq: -4.5438 -0.0024 0.0008 0.0019 4.7000 9.7636 14.2186 16.8305 26.9985
frequency: 9.7016 15.0956 26.9843 32.2848 40.7798 48.2535 49.2211 69.2456 73.7208 78.4365 88.2989 94.0154 102.1791 117.2589 118.1062 126.3678 128.5520 140.2265 146.3013 157.0789 159.6982 183.6027 227.2422 229.4413 250.0249 306.8201 335.1912 374.5058 410.7411 440.1048 459.0106 468.9742 496.8282 505.8737 582.2583 712.9979 720.8502 721.1165 722.7786 727.6762 738.1717 755.7899 780.6649 810.3109 820.9367 848.6835 886.7387 887.0614 923.7699 938.6677 957.7008 973.9386 979.9969 986.0139 998.9861 1013.0608 1014.4455 1028.1025 1037.6141 1046.8727 1055.9556 1069.9590 1075.6348 1079.5248 1081.7416 1082.8227 1083.3653 1097.7102 1123.5234 1123.9427 1165.3276 1179.9230 1191.6733 1196.2636 1208.9273 1217.5055 1228.1017 1237.6627 1247.2448 1256.5898 1264.5844 1274.9008 1276.8014 1279.0374 1281.0577 1286.4634 1289.1764 1293.5524 1294.4789 1296.2670 1299.9471 1300.2807 1312.4025 1327.9458 1341.2894 1350.1420 1352.1384 1353.9766 1355.4243 1356.6305 1358.4041 1367.6974 1387.6628 1428.1946 1443.5958 1455.9296 1459.1408 1459.3525 1460.6820 1461.2395 1462.8487 1463.6981 1464.7053 1467.4533 1471.2198 1475.2262 1476.6911 1479.1965 1482.8555 1486.0091 1488.3906 1489.7790 1635.6654 2947.3755 2948.4502 2948.6549 2949.2793 2949.8338 2950.7299 2950.9857 2951.5400 2953.1896 2956.1434 2959.5187 2962.8252 2965.6410 2968.2757 2971.2216 2979.4138 2981.2777 2982.4265 2984.2890 2986.8575 2989.9691 2991.5835 2995.0612 2996.1585 3001.8351 3009.5831 3017.6669 3025.5901 3032.9008 3039.1913 3043.9088 3056.2268 3065.8068 3067.8355 3069.9831 3118.6575
redmass: 4.1851 4.2395 3.8983 2.3354 4.0742 2.0075 2.5451 1.5624 2.7105 3.6104 1.2374 1.5205 2.5253 3.8557 1.8891 2.4983 3.3228 1.8571 2.1320 1.9937 2.0517 3.7183 4.3284 1.1180 3.4704 3.4340 3.6316 3.1412 3.2173 3.0971 2.2137 2.7987 3.0337 2.9823 4.0124 1.1099 1.0578 1.0612 1.0747 1.0972 1.1292 1.1671 1.2071 1.3580 2.7277 1.2623 1.4194 1.6157 1.2594 2.0242 1.2434 5.3876 4.3797 1.2199 4.3037 2.4223 1.3725 3.5443 1.0541 3.2893 3.1459 2.8305 2.5565 2.0341 2.0863 2.2032 2.3313 3.1673 1.7190 2.9013 1.9538 1.9565 1.7233 1.2953 1.5448 1.3441 1.4251 1.3465 1.3400 1.3424 1.2705 1.2854 1.0846 1.1316 1.0524 1.0713 1.1135 1.1780 1.2173 1.1383 1.1180 1.1092 1.3965 1.4410 1.4911 1.5635 1.7242 1.6800 1.6463 1.6387 1.6904 1.2416 1.2169 1.0907 1.0676 1.0573 1.0734 1.0732 1.0716 1.0715 1.0674 1.0674 1.0689 1.0843 1.0865 1.0866 1.0439 1.0891 1.0922 1.0947 1.0961 1.0976 7.7517 1.0590 1.0583 1.0584 1.0587 1.0589 1.0597 1.0594 1.0595 1.0595 1.0595 1.0592 1.0588 1.0583 1.0585 1.0365 1.0382 1.0958 1.0962 1.0968 1.0971 1.0871 1.0770 1.0945 1.0985 1.1026 1.1040 1.1048 1.1051 1.1051 1.1048 1.1045 1.1030 1.0951 1.1007 1.0992 1.1004
irintensity: 0.1543 0.1221 0.0657 3.6520 0.5267 0.5371 0.1492 0.0030 0.1428 1.0130 0.2554 0.0158 0.1785 0.1561 0.0305 0.4271 1.1403 0.0097 0.0768 0.0002 0.0100 2.0619 0.7789 0.0007 0.8241 1.1380 0.4780 0.2829 2.7191 0.4225 0.2159 2.5301 0.1917 0.9439 4.8902 8.4099 19.9030 4.5279 4.5393 0.7132 0.7078 0.5971 0.4259 0.3182 0.6793 0.7003 2.1881 2.8849 2.9643 8.1678 0.7009 0.0225 0.5426 2.5332 0.0109 0.6500 0.6261 0.6786 0.4041 0.5359 0.1695 0.2182 0.4594 0.0729 0.0936 0.4903 0.1294 11.2678 1.3339 8.3708 30.9045 0.0908 0.2953 57.5871 0.0472 8.3002 0.0062 13.2944 0.0649 10.3755 0.1569 9.8158 1.1553 0.0729 0.3030 0.0772 0.3032 3.2082 5.8707 1.3370 0.0093 0.0545 9.1148 9.6092 5.3274 6.6261 0.5109 0.4192 1.9650 0.7066 8.0225 61.7132 11.2508 22.4718 22.2483 17.8664 0.0603 0.0496 0.1033 0.1215 0.1469 0.1308 0.1725 0.6036 1.1998 1.3100 12.0871 2.2585 1.4941 4.5380 3.1840 50.5077 104.6342 2.5085 0.0699 0.3245 0.2622 1.4440 7.5682 5.5187 9.6341 1.2474 0.0986 8.3639 0.4125 207.0653 250.3248 37.6394 5.1732 0.1223 0.4456 0.9917 2.2349 13.4316 21.2906 7.3152 2.9052 0.3574 0.2110 2.3586 0.0631 19.2014 0.0620 374.9398 106.2490 20.8279 100.5979 55.8153 15.4928
temp: 298.150 k
press: 1.00000 atm
elementType: 8 6 6 6 6 6 6 6 6 6 6 6 6 6 6 6 6 6 6 1 1 1 1 1 1 1 1 1 1 1 1 1 1 1 1 1 1 1 1 1 1 1 1 1 1 1 1 1 1 1 1 1 1 1 1
symmnumber: 1
zpe: 1314162.4 jmol-1
zpe.correction: 0.500538 hartree
zpe.thermalcorrener: 0.526704 hartree
zpe.thermalcorrenthalpy: 0.527648 hartree
zpe.thermalcorrgfe: 0.438166 hartree
zpe.sumelectzpe: -781.152645 hartree
zpe.sumelectthermal: -781.126479 hartree
zpe.sumelectthermalent: -781.125534 hartree
zpe.sumelectthermalfe: -781.215016 hartree
dipole: 0.2566 -3.0563 0.2754
dipole: 3.0794
quadrupole: -128.4389 -129.0706 -119.8720
quadrupole: 28.4840 -2.8685 0.1666
quadrupole: -2.6451 -3.2768 5.9218 28.4840 -2.8685 0.1666
hfenergy: -781.6531829 hartree
pointgroup: C01 [X(C18H36O1)]
dipole: 0.1052546 1.203235 -0.0947504 debye
polarizability: 271.2393868|-2.7636714|176.2032763|1.0944794|-0.2554524|156.141126 unknown
InChI: InChI=1S/C18H36O/c1-3-4-5-6-7-8-9-10-11-12-13-14-15-16-17-18(2)19/h3-17H2,1-2H3
charge 0 multiplicity 1
55 atoms
O  -9.195346 -1.479448 0.104484
C  1.139788 -0.335305 -0.024966
C  2.44143 0.495314 0.038993
C  -0.142156 0.525467 0.038289
C  3.7219 -0.367862 -0.021326
C  -1.442254 -0.307223 -0.029694
C  5.025016 0.460415 0.043253
C  -2.725631 0.550762 0.041648
C  6.304018 -0.404924 -0.017659
C  -4.023587 -0.284151 -0.035719
C  7.60845 0.42112 0.051424
C  -5.308838 0.569843 0.049126
C  8.886602 -0.445347 -0.012733
C  -6.599011 -0.27474 -0.038892
C  10.191729 0.379649 0.064943
C  -7.876223 0.580339 0.052976
C  11.46279 -0.494508 -0.004447
C  -9.180283 -0.222269 0.022996
C  -10.47066 0.580838 -0.123856
H  1.133151 -0.933753 -0.960179
H  1.130918 -1.066279 0.810658
H  2.451828 1.224906 -0.797868
H  2.447765 1.095147 0.973352
H  -0.137125 1.121438 0.975131
H  -0.132564 1.258456 -0.795622
H  3.715366 -0.96758 -0.955744
H  3.710607 -1.09768 0.815312
H  -1.449142 -0.89904 -0.969059
H  -1.448625 -1.044064 0.800706
H  5.036735 1.190647 -0.793032
H  5.032289 1.059563 0.978048
H  -2.716536 1.292295 -0.784756
H  -2.72182 1.136934 0.984703
H  6.297881 -1.001965 -0.953792
H  6.290292 -1.137178 0.816819
H  -4.027875 -1.031909 0.78455
H  -4.030866 -0.863379 -0.98266
H  7.615945 1.015895 0.989059
H  7.621713 1.155247 -0.781468
H  -5.299906 1.323928 -0.766192
H  -5.303819 1.141711 1.001301
H  8.87189 -1.18325 0.816803
H  8.883304 -1.036067 -0.952925
H  -6.610273 -0.846134 -0.987622
H  -6.61312 -1.031943 0.767797
H  10.195132 0.966321 1.006471
H  10.204484 1.119431 -0.761537
H  -7.875523 1.171605 0.995233
H  -7.911234 1.336872 -0.759271
H  11.499594 -1.064741 -0.952046
H  11.486312 -1.225055 0.826297
H  12.381509 0.11763 0.057558
H  -10.601528 0.870073 -1.185426
H  -10.438266 1.515003 0.465597
H  -11.337228 -0.028259 0.177962
