program: Gaussian 09
title: 000081780
version: EM64L-G09RevD.01
frameworkgroup: C1[X(C10H18O2)]
method: RPBEPBE
basis: SDD
operation: Freq
keyword: #pfreq=noraman
keyword: PBEPBE/SDD
title: #p freq=noraman PBEPBE/SDD
converged: YES YES NO NO
title: Mulliken charges:
elementType: O O C C C C C C C C C C H H H H H H H H H H H H H H H H H H
charge: -0.183189 -0.201592 0.186752 0.192996 -0.661697 -0.716890 -0.704310 -0.707790 -0.162252 0.256079 -0.690964 -0.693207 0.270274 0.245410 0.214355 0.254589 0.201987 0.199166 0.230898 0.235416 0.234055 0.205031 0.224932 0.217212 0.210629 0.229595 0.236247 0.223153 0.211875 0.241240
chargesum: 0.00000
title: Mulliken charges with hydrogens summed into heavy atoms:
elementType: O O C C C C C C C C C C
charge: -0.183189 -0.201592 0.186752 0.192996 -0.146013 -0.045959 -0.038830 -0.043773 0.054959 0.256079 -0.014493 -0.016938
polarizability: 1.29603896e+02 -2.53831400e+00 1.06038847e+02 9.38278270e-01 -1.38683500e+00 9.91405357e+01
1716.lowfreq: -15.3964 -10.9897 -6.7230 -0.0007 -0.0005 0.0003 11.9122 35.9776 37.9241
frequency: 10.5483 35.7110 37.1741 83.3391 117.0396 173.3814 183.0310 203.5260 208.6176 218.1496 242.8278 248.7455 263.9484 273.5090 295.8531 339.1965 350.0555 360.9866 404.3094 438.6297 553.7459 563.5278 572.4432 661.6320 702.4565 816.3994 839.7896 880.2102 903.9148 923.6341 928.6128 937.5652 948.3949 961.7355 1006.7582 1018.3541 1036.5167 1058.3556 1096.9705 1108.1855 1173.2508 1180.3825 1195.3247 1228.8038 1251.7830 1275.1872 1289.2823 1333.3036 1371.4382 1375.4739 1377.0805 1393.6811 1400.6703 1419.3335 1453.6089 1462.8343 1464.3301 1466.3675 1469.2949 1475.1653 1478.0591 1480.3190 1487.8883 1496.1673 1609.6462 1639.1010 2973.7447 2976.9497 2979.3947 2983.8292 2988.4981 2988.7936 2993.3124 3043.2682 3065.2452 3070.2164 3074.1696 3080.8861 3084.8722 3085.2447 3088.8606 3093.6062 3098.5962 3099.6163
redmass: 3.2760 3.6685 2.9503 5.3760 5.0585 1.0688 1.0681 2.7422 2.4728 1.7762 1.1894 1.4132 1.8271 1.3416 2.9369 2.3319 2.7180 2.2907 2.6581 2.1777 3.4286 3.1081 4.9564 3.3179 3.5945 3.0728 3.1965 2.7309 2.3450 1.2167 1.7078 1.5597 1.2057 1.4241 1.4777 1.5148 2.7778 1.7127 1.6888 2.5543 1.7985 1.5243 2.5307 3.1738 1.5690 2.7745 1.4318 1.6168 1.1813 1.1932 1.1969 1.2000 1.2056 1.1196 1.0491 1.0455 1.0488 1.0498 1.0478 1.0517 1.0487 1.0549 1.0563 1.0689 9.0187 8.5235 1.0345 1.0361 1.0352 1.0615 1.0396 1.0407 1.0706 1.0995 1.0991 1.0989 1.0995 1.1007 1.0999 1.1002 1.1011 1.1000 1.0998 1.0994
irintensity: 0.8103 1.3259 0.3221 3.2951 0.3929 0.3719 0.0317 1.7281 0.1226 1.1950 1.3529 0.8867 1.2803 0.5647 6.3285 3.2269 1.3524 0.0695 1.7642 2.5412 5.6321 0.5808 1.0016 7.4252 3.9985 5.2080 5.1884 2.7588 1.5255 2.7622 2.5820 4.2033 0.2681 3.1895 9.9773 9.2772 101.3482 39.5507 6.3634 30.2920 12.1232 31.9817 11.6688 9.7647 90.3538 14.6139 25.6523 20.5514 17.4613 9.1380 22.2601 24.0070 18.2503 18.8904 0.2383 7.7134 1.0601 3.9019 0.7898 13.7922 10.2168 26.8311 37.2749 34.5400 89.6789 100.9131 25.5665 19.6315 34.0766 20.7580 13.4878 32.2650 18.3319 7.3246 16.1172 77.8786 30.5789 14.5440 27.3057 31.3092 14.4268 25.5900 28.7605 29.9549
temp: 298.150 k
press: 1.00000 atm
elementType: 8 8 6 6 6 6 6 6 6 6 6 6 1 1 1 1 1 1 1 1 1 1 1 1 1 1 1 1 1 1
symmnumber: 1
zpe: 676037.6 jmol-1
zpe.correction: 0.257489 hartree
zpe.thermalcorrener: 0.272935 hartree
zpe.thermalcorrenthalpy: 0.273879 hartree
zpe.thermalcorrgfe: 0.213580 hartree
zpe.sumelectzpe: -541.331609 hartree
zpe.sumelectthermal: -541.316163 hartree
zpe.sumelectthermalent: -541.315219 hartree
zpe.sumelectthermalfe: -541.375519 hartree
dipole: -1.4411 3.9272 -2.3055
dipole: 4.7765
quadrupole: -69.1175 -81.2355 -75.6377
quadrupole: 3.8789 3.7602 1.0102
quadrupole: 6.2127 -5.9053 -0.3074 3.8789 3.7602 1.0102
hfenergy: -541.5890982 hartree
pointgroup: C01 [X(C10H18O2)]
dipole: -0.5563188 1.7112937 -0.5417582 debye
polarizability: 129.4952115|-3.0721477|106.4030265|-0.6599467|0.2586637|98.885041 unknown
InChI: InChI=1S/C10H18O2/c1-7(2)8(11)6-9(12)10(3,4)5/h7H,6H2,1-5H3
charge 0 multiplicity 1
30 atoms
O  1.491163 -1.794004 -0.979171
O  -1.094979 -0.929714 1.024005
C  2.17159 0.332521 0.04973
C  1.184821 -0.609789 -0.682027
C  -0.192648 -0.074086 -1.097293
C  1.458172 1.147533 1.162904
C  3.324263 -0.498807 0.661412
C  2.746545 1.30957 -1.026269
C  -2.667404 0.319201 -0.374771
C  -1.297476 -0.300831 -0.044327
C  -2.726744 1.732282 0.280039
C  -3.822055 -0.57563 0.12627
H  -0.508306 -0.617095 -2.010377
H  -0.172276 1.003474 -1.35013
H  2.196237 1.801947 1.662507
H  1.011953 0.480235 1.919753
H  0.657179 1.796344 0.76198
H  4.062986 0.172349 1.137352
H  2.941088 -1.198212 1.425026
H  3.833026 -1.100472 -0.110291
H  3.276342 0.756318 -1.822413
H  1.957639 1.926539 -1.495789
H  3.467495 1.99542 -0.544492
H  -2.737748 0.44602 -1.473585
H  -1.91187 2.391631 -0.0728
H  -3.68711 2.21899 0.033303
H  -2.652874 1.646074 1.378793
H  -3.822846 -1.555991 -0.382723
H  -4.795734 -0.087545 -0.059989
H  -3.71773 -0.759774 1.209271
