program: Gaussian 09
title: 000081769
version: EM64L-G09RevD.01
frameworkgroup: C1[X(C12H20O2)]
method: RPBEPBE
basis: SDD
operation: Freq
keyword: #pfreq=noraman
keyword: PBEPBE/SDD
title: #p freq=noraman PBEPBE/SDD
converged: YES YES NO NO
title: Mulliken charges:
elementType: O O C C C C C C C C C C C C H H H H H H H H H H H H H H H H H H H H
charge: -0.279843 -0.266362 -0.339558 -0.367509 -0.356586 -0.468454 -0.693043 -0.149789 -0.231832 -0.130386 -0.371624 -0.226994 0.230174 -0.674579 0.186320 0.190942 0.195954 0.210940 0.197723 0.195710 0.206023 0.211975 0.210063 0.210291 0.217579 0.228970 0.234443 0.257172 0.252089 0.226609 0.226366 0.228982 0.229043 0.209193
chargesum: 0.00000
title: Mulliken charges with hydrogens summed into heavy atoms:
elementType: O O C C C C C C C C C C C C
charge: -0.279843 -0.266362 0.037703 0.039384 0.036847 -0.050456 -0.055109 0.079181 0.002611 0.126786 -0.119535 0.225981 0.230174 -0.007362
polarizability: 2.83380053e+02 -1.24383809e+01 1.17401828e+02 -1.26280353e+01 -4.61691661e+00 9.68537688e+01
1716.lowfreq: -10.2345 -0.0012 0.0005 0.0012 1.2975 6.0436 15.8348 32.7517 36.9896
frequency: 14.9299 32.3258 36.5552 50.4851 67.5758 72.8451 103.6603 113.6828 134.9318 146.9991 163.4039 206.5315 228.4923 234.8370 242.3545 275.8838 296.4208 340.9687 356.4224 381.3184 438.0781 479.9267 554.6939 678.3495 705.3759 724.1552 750.6982 798.5250 812.4170 826.6117 847.2579 890.1730 895.9444 943.9878 953.4969 955.1080 996.3266 1019.9148 1027.7557 1031.8775 1049.2463 1075.4149 1102.5744 1106.4495 1116.1247 1128.9190 1135.5876 1190.4053 1205.2586 1225.1055 1241.5872 1248.0541 1254.9431 1280.9795 1287.0299 1288.9698 1291.7904 1302.4603 1327.5948 1342.9292 1351.9112 1361.1354 1388.7302 1399.6419 1455.8389 1463.2706 1464.3286 1470.2052 1473.9381 1476.9042 1479.5926 1487.0859 1487.8761 1599.6298 1621.6860 1657.1682 2949.9186 2955.3657 2966.6197 2973.0674 2973.7611 2994.3371 2994.6883 3005.2010 3012.3782 3025.1978 3046.0865 3061.9465 3069.8040 3072.9675 3075.9919 3090.9278 3092.0356 3105.1440 3105.3610 3151.2056
redmass: 3.9407 2.1300 3.1840 2.9553 2.8707 3.3719 2.4005 1.9421 3.1215 2.6558 2.9648 2.9964 1.1269 2.7190 1.5720 2.2844 3.6373 3.7231 2.8189 4.0203 3.2721 3.0663 3.2881 4.6224 5.7835 1.0729 1.1563 1.0989 1.5630 3.0313 1.4588 1.8757 1.7400 2.3583 1.3378 1.6754 3.7940 1.1139 2.2094 2.3883 2.0681 2.3503 3.0003 2.0823 2.3684 1.8483 1.4689 1.8282 1.8942 1.3935 1.3272 1.1349 1.2616 1.3037 1.2645 1.1339 1.3257 1.2665 1.3884 1.4415 1.6065 1.5014 1.2145 1.2722 1.0916 1.0405 1.0691 1.0750 1.0596 1.0423 1.0730 1.0685 1.0874 9.7950 6.4611 5.8699 1.0624 1.0587 1.0596 1.0368 1.0596 1.0359 1.0974 1.0580 1.0974 1.1014 1.1036 1.1064 1.1007 1.0993 1.0922 1.0985 1.0909 1.1022 1.0896 1.0916
irintensity: 0.1427 0.0432 0.4839 0.0192 1.0478 1.4536 0.2982 0.0568 1.0792 1.9360 1.5319 0.4435 0.0154 2.6435 1.4864 3.7774 9.1649 3.1825 1.4957 7.3360 0.7193 0.5915 1.9990 4.2129 3.7926 13.0276 2.6071 4.8248 10.0858 1.7424 9.3227 2.9105 9.4289 66.8211 10.1521 7.5143 6.3799 86.2464 51.3458 57.7232 30.1575 0.6013 297.0166 83.1227 91.5276 32.9804 5.0859 3.4713 30.6411 77.1703 38.6614 0.0162 49.2132 2.1918 2.6136 5.3278 47.7275 2.8199 45.7231 33.8571 0.8102 17.6881 10.5437 18.6738 3.7189 11.4870 0.8506 1.8981 5.6596 12.6938 3.9099 12.2416 21.6409 250.6480 114.2271 166.5098 17.8006 11.3676 6.4699 61.6557 82.0602 27.9287 2.5650 22.9910 5.2337 4.7492 67.7669 11.2425 89.4299 52.5983 24.9836 35.6795 14.4004 46.7402 17.6466 8.5296
temp: 298.150 k
press: 1.00000 atm
elementType: 8 8 6 6 6 6 6 6 6 6 6 6 6 6 1 1 1 1 1 1 1 1 1 1 1 1 1 1 1 1 1 1 1 1
symmnumber: 1
zpe: 767964.7 jmol-1
zpe.correction: 0.292502 hartree
zpe.thermalcorrener: 0.310015 hartree
zpe.thermalcorrenthalpy: 0.310959 hartree
zpe.thermalcorrgfe: 0.243911 hartree
zpe.sumelectzpe: -618.590822 hartree
zpe.sumelectthermal: -618.573309 hartree
zpe.sumelectthermalent: -618.572365 hartree
zpe.sumelectthermalfe: -618.639413 hartree
dipole: -1.9638 -1.4777 0.4750
dipole: 2.5032
quadrupole: -72.1599 -88.9112 -87.9909
quadrupole: -6.9219 -1.1578 0.7787
quadrupole: 10.8608 -5.8905 -4.9703 -6.9219 -1.1578 0.7787
hfenergy: -618.883324 hartree
pointgroup: C01 [X(C12H20O2)]
dipole: 0.7760738 -0.4868889 -0.3612919 debye
polarizability: 283.2235592|16.7727571|112.6992693|-7.7161783|9.8780529|101.712821 unknown
InChI: InChI=1S/C12H20O2/c1-3-5-6-7-8-9-10-11-12(13)14-4-2/h8-11H,3-7H2,1-2H3
charge 0 multiplicity 1
34 atoms
O  -4.530702 -0.606674 -0.130404
O  -3.645434 1.294912 0.909035
C  5.237409 -0.187122 -0.279135
C  3.817827 0.140401 0.235659
C  6.266572 -0.371412 0.859394
C  2.791048 0.328289 -0.917445
C  7.684797 -0.695037 0.341728
C  1.422026 0.718761 -0.422498
C  0.266863 0.015048 -0.64259
C  -1.028709 0.431879 -0.131571
C  -2.204815 -0.243841 -0.338087
C  -5.878128 -0.211094 0.372244
C  -3.474663 0.255136 0.217803
C  -6.86121 -1.267932 -0.121367
H  5.58008 0.624706 -0.954662
H  5.202931 -1.110136 -0.894749
H  3.852631 1.064478 0.848745
H  3.466645 -0.668405 0.906759
H  5.923394 -1.182438 1.53351
H  6.297913 0.551069 1.474472
H  3.178486 1.121666 -1.592644
H  2.730186 -0.60017 -1.51779
H  8.063575 0.114615 -0.310265
H  7.687898 -1.630198 -0.249423
H  8.400362 -0.820108 1.174959
H  1.365742 1.64349 0.175046
H  0.306584 -0.911318 -1.234643
H  -1.073627 1.356227 0.463914
H  -2.247734 -1.171262 -0.919149
H  -6.112562 0.798555 -0.012153
H  -5.837125 -0.152951 1.475464
H  -6.593612 -2.266039 0.265816
H  -6.869144 -1.313679 -1.223888
H  -7.882004 -1.022416 0.224517
