program: Gaussian 09
title: 000081776
version: EM64L-G09RevD.01
frameworkgroup: C1[X(C8H18S8)]
method: RPBEPBE
basis: SDD
operation: Freq
keyword: #pfreq=noraman
keyword: PBEPBE/SDD
title: #p freq=noraman PBEPBE/SDD
converged: YES YES NO NO
title: Mulliken charges:
elementType: S S S S S S S S C C C C C C C C H H H H H H H H H H H H H H H H H H
charge: 0.036659 0.058299 -0.045515 -0.047317 -0.045136 -0.038401 -0.011970 -0.019466 -0.090057 -0.092752 -0.631266 -0.654742 -0.626808 -0.630996 -0.656951 -0.629395 0.229577 0.212219 0.241487 0.237459 0.233546 0.225166 0.235034 0.211722 0.235441 0.230159 0.210612 0.238588 0.244968 0.231916 0.222083 0.229194 0.208903 0.247739
chargesum: 0.00000
title: Mulliken charges with hydrogens summed into heavy atoms:
elementType: S S S S S S S S C C C C C C C C
charge: 0.036659 0.058299 -0.045515 -0.047317 -0.045136 -0.038401 -0.011970 -0.019466 -0.090057 -0.092752 0.052017 0.041429 0.055390 0.048363 0.042016 0.056441
polarizability: 3.59316248e+02 -2.03771962e+01 3.14414257e+02 3.22354804e+00 -2.34682343e+00 1.83680029e+02
1716.lowfreq: -10.5689 -7.0730 0.0014 0.0024 0.0034 2.3724 3.9824 13.7930 17.1558
frequency: -6.0884 13.0051 16.8482 20.6488 25.3260 31.5543 44.3971 48.3925 64.3350 81.3275 103.7224 121.5718 143.9711 164.2832 171.1762 175.5572 191.6547 195.4200 210.7227 231.2709 252.4960 258.8924 262.2683 264.8850 271.5260 274.6335 281.4509 283.9552 313.3063 343.1075 343.3676 350.7173 375.2278 382.2822 383.9337 385.2769 391.1879 391.9903 434.1684 434.9757 500.4368 500.6296 784.4933 785.3059 927.7204 928.7466 928.9216 930.6074 954.3794 954.5311 1014.8657 1015.4508 1020.5573 1021.6721 1154.1707 1155.3817 1233.1145 1234.1691 1241.4428 1241.6079 1376.1081 1376.5909 1379.1350 1380.4907 1403.0757 1403.6244 1445.4694 1447.3028 1456.1480 1458.1475 1459.1839 1461.7078 1471.0622 1471.6767 1472.1046 1474.3070 1486.0228 1489.3037 2972.5186 2973.5159 2974.3099 2976.4413 2978.2800 2980.2443 3065.8384 3067.5352 3067.7953 3070.5421 3073.3622 3075.6769 3085.2314 3087.6132 3093.4391 3094.2721 3097.6309 3099.1842
redmass: 5.8424 4.3507 5.0060 4.4796 5.4806 4.1545 9.8313 5.9459 7.1467 10.2010 9.3191 13.5319 7.3332 7.1128 10.6513 1.0650 11.2024 1.0327 12.1956 1.0813 1.0883 1.1695 8.6356 1.5761 2.3494 1.9398 3.0176 3.0173 22.5949 3.2625 3.2790 28.6553 20.5738 6.1439 2.7509 2.9533 3.2732 3.3092 9.2223 9.3469 3.1612 3.1386 3.3178 3.3082 1.5449 1.5486 1.5205 1.5282 1.2058 1.2063 1.4760 1.4728 1.4436 1.4344 1.8750 1.8736 3.0757 3.0559 3.0422 3.0463 1.1913 1.1924 1.2103 1.2096 1.1976 1.1969 1.0467 1.0466 1.0483 1.0479 1.0486 1.0483 1.0527 1.0515 1.0514 1.0517 1.0518 1.0518 1.0372 1.0356 1.0369 1.0359 1.0368 1.0367 1.0970 1.0981 1.0973 1.0977 1.0970 1.0970 1.1012 1.1011 1.1005 1.1005 1.1004 1.1003
irintensity: 0.1550 0.3552 0.6685 0.3469 0.1508 0.0416 0.1144 0.4272 0.3104 0.7172 0.3217 0.0294 0.3577 0.7727 0.4395 0.0204 1.0854 0.0385 0.7622 0.0215 0.0964 0.9223 3.0458 0.6682 0.6469 0.1075 0.5420 0.9521 1.1899 0.7855 0.6607 4.8177 1.3273 2.9165 0.7094 0.9995 2.2343 3.5086 9.7058 11.2615 6.2404 10.3960 0.3693 0.2125 1.0521 0.8655 0.7989 0.8755 0.0364 0.0145 1.4653 4.2133 0.8579 0.6140 124.5451 201.6930 6.4368 7.4552 9.2611 8.8737 22.3977 40.0294 24.6550 28.6418 10.6465 14.2058 0.2611 0.1708 0.6115 1.0707 1.1562 0.9420 20.7188 5.8758 20.0128 15.3716 19.6721 26.2421 14.8260 15.4099 17.7410 15.9579 47.4089 56.8486 3.9681 4.3989 2.9951 6.9454 50.9519 70.6574 9.1781 7.8282 22.5084 24.3066 17.1069 20.1103
temp: 298.150 k
press: 1.00000 atm
elementType: 16 16 16 16 16 16 16 16 6 6 6 6 6 6 6 6 1 1 1 1 1 1 1 1 1 1 1 1 1 1 1 1 1 1
symmnumber: 1
zpe: 652012.2 jmol-1
zpe.correction: 0.248338 hartree
zpe.thermalcorrener: 0.273948 hartree
zpe.thermalcorrenthalpy: 0.274892 hartree
zpe.thermalcorrgfe: 0.187492 hartree
zpe.sumelectzpe: -3498.847078 hartree
zpe.sumelectthermal: -3498.821468 hartree
zpe.sumelectthermalent: -3498.820524 hartree
zpe.sumelectthermalfe: -3498.907924 hartree
dipole: -3.6823 4.5666 0.4644
dipole: 5.8846
quadrupole: -142.9176 -152.8791 -161.1601
quadrupole: 1.4962 4.0102 0.8521
quadrupole: 9.4014 -0.5602 -8.8411 1.4962 4.0102 0.8521
hfenergy: -3499.0954162 hartree
pointgroup: C01 [X(C8H18S8)]
dipole: -1.1449273 -2.0080476 -0.1304352 debye
polarizability: 351.9668626|26.4492829|321.3419253|1.1621346|-8.0160358|184.1017467 unknown
InChI: InChI=1S/C8H18S8/c1-7(2,3)9-11-13-15-16-14-12-10-8(4,5)6/h1-6H3
charge 0 multiplicity 1
34 atoms
S  -2.007393 -0.761653 0.058077
S  3.028456 -0.10169 1.242817
S  -1.600411 0.913484 -1.370079
S  4.153567 1.517037 0.183077
S  -1.870095 2.930798 -0.256546
S  2.665597 2.545826 -1.261248
S  -0.066722 3.19346 1.078127
S  1.61239 4.192448 -0.120767
C  -3.947842 -1.014655 -0.020931
C  3.104407 -1.631508 0.025681
C  -4.359903 -1.318667 -1.47132
C  -4.14922 -2.23518 0.907027
C  -4.642286 0.24343 0.528183
C  4.5730 -2.048648 -0.165251
C  2.292706 -2.69244 0.805784
C  2.427475 -1.263657 -1.305546
H  -3.853173 -2.222113 -1.852791
H  -5.453643 -1.486347 -1.515489
H  -4.11767 -0.472672 -2.138655
H  -3.81399 -2.023759 1.938107
H  -3.612049 -3.125388 0.533592
H  -5.228165 -2.479173 0.943686
H  -4.440709 1.12427 -0.106363
H  -5.737533 0.079047 0.543582
H  -4.309847 0.473025 1.555055
H  5.045754 -2.310238 0.797435
H  4.622867 -2.932812 -0.83052
H  5.157799 -1.236831 -0.63337
H  1.245437 -2.373034 0.952336
H  2.741916 -2.909862 1.791771
H  2.28541 -3.632579 0.221591
H  2.989305 -0.475805 -1.837633
H  2.398589 -2.158957 -1.957266
H  1.393577 -0.909454 -1.153154
