program: Gaussian 09
title: 000081756
version: EM64L-G09RevD.01
frameworkgroup: C1[X(C5H10N2S)]
method: RPBEPBE
basis: SDD
operation: Freq
keyword: #p
keyword: freq=noraman
keyword: PBEPBE/SDD
title: #p freq=noraman PBEPBE/SDD
converged: YES YES NO NO
title: Mulliken charges:
elementType: S N N C C C C C H H H H H H H H H H
charge: 0.192235 -0.416149 -0.075539 -0.365802 -0.471265 -0.080399 -0.565100 -0.664627 0.223744 0.224327 0.227884 0.227772 0.302331 0.282107 0.279152 0.226906 0.227695 0.224729
chargesum: 0.00000
title: Mulliken charges with hydrogens summed into heavy atoms:
elementType: S N N C C C C C
charge: 0.192235 -0.113818 -0.075539 0.082268 -0.015609 -0.080399 -0.003841 0.014703
polarizability: 1.18053146e+02 5.54591269e-01 8.25115571e+01 8.85987513e-02 4.61709911e-02 5.20551192e+01
1716.lowfreq: -57.2873 -9.4943 -0.0003 0.0014 0.0018 9.7782 13.4091 25.7477 58.7201
frequency: -56.8476 25.0462 58.3048 119.7593 198.9753 227.7808 271.0350 288.7390 317.9532 472.6559 589.0633 620.7630 724.5132 773.7673 826.3526 868.7206 930.1630 955.2738 995.6287 1028.3614 1044.9811 1069.9755 1076.4293 1166.6712 1175.6310 1209.3984 1228.3788 1266.2878 1274.9929 1288.1191 1395.7851 1424.5549 1452.2179 1470.2380 1471.1440 1482.2927 1505.0199 1553.1602 2973.7566 2985.7876 3004.5185 3018.9597 3052.0740 3058.2214 3080.4799 3083.1717 3131.3375 3618.2333
redmass: 1.9498 2.0720 4.4548 3.7619 3.4427 1.1252 1.1596 3.4386 5.4495 10.7976 5.5609 4.6624 6.3710 1.1119 1.1884 6.6481 4.6015 4.6605 1.7886 3.9195 1.2127 2.2708 1.5837 1.1227 2.4352 1.0866 1.2327 1.3486 1.3562 1.2628 1.2108 1.9093 1.0860 1.0398 1.1283 1.0490 1.1024 5.6874 1.0568 1.0355 1.0599 1.1085 1.0606 1.1074 1.0963 1.1010 1.1084 1.0805
irintensity: 24.5167 0.1005 7.9327 4.2418 16.2329 1.0901 132.3937 2.5051 4.6461 5.6540 0.2400 5.1395 0.9393 9.7688 1.8295 12.3957 27.8064 0.4192 26.3289 8.1437 0.0696 0.4973 0.0800 1.4203 101.5801 0.0276 0.8897 92.1190 15.1895 18.7303 20.5277 127.4212 8.8365 14.9671 2.1640 8.9738 7.8974 165.7163 76.7596 31.7928 86.9830 19.1878 3.1545 57.2186 26.8622 18.0323 22.1688 30.5979
temp: 298.150 k
press: 1.00000 atm
elementType: 16 7 7 6 6 6 6 6 1 1 1 1 1 1 1 1 1 1
symmnumber: 1
zpe: 387917.1 jmol-1
zpe.correction: 0.147750 hartree
zpe.thermalcorrener: 0.156638 hartree
zpe.thermalcorrenthalpy: 0.157582 hartree
zpe.thermalcorrgfe: 0.112342 hartree
zpe.sumelectzpe: -703.434650 hartree
zpe.sumelectthermal: -703.425762 hartree
zpe.sumelectthermalent: -703.424817 hartree
zpe.sumelectthermalfe: -703.470058 hartree
dipole: -1.2926 -0.9587 0.0677
dipole: 1.6108
quadrupole: -43.8120 -56.1118 -57.5541
quadrupole: 4.0105 -0.0223 -0.0697
quadrupole: 8.6806 -3.6191 -5.0615 4.0105 -0.0223 -0.0697
hfenergy: -703.5823998 hartree
pointgroup: C01[X(C5H10N2S1)]
dipole: -0.5154953 -0.3683555 0.0138207 debye
dipolederiv: -0.6842084 -0.0066769 -0.0021656 0.042538 -0.1575551 -0.001446 0.0027688 -0.0000716 -0.1101363 -1.0103767 -0.3978937 -0.01266 0.0666718 -0.5779612 -0.0121914 -0.0053549 -0.0188078 -0.5034705 -0.7346906 0.1079765 0.0033772 0.2918033 -0.9733939 -0.019402 0.0133972 -0.0240811 -0.3447773 0.4097625 -0.0383673 -0.0047258 -0.2953231 -0.0570259 -0.0095608 -0.0119547 -0.0100268 0.3708066 0.3121561 -0.1605708 -0.0043196 -0.0865033 0.2493829 -0.0017182 -0.0020801 -0.00021 0.2870141 1.4891831 0.2035351 0.0076172 -0.2266238 1.0778293 0.0337722 -0.0070911 0.036908 0.0577793 0.38412 0.2134722 0.0107271 0.3405728 0.1875919 0.0070706 0.0140383 0.0066944 0.1333019 -0.1290047 0.0136333 0.0036911 -0.1522936 0.0295089 -0.0029714 -0.0076778 -0.0046638 0.0759954 -0.1159123 -0.0395082 0.0962479 -0.0168792 0.0686112 0.050379 0.1722419 0.0597224 -0.0938716 -0.1213713 -0.0347086 -0.0984353 -0.0102315 0.0756306 -0.0398997 -0.1696375 -0.0487026 -0.0896533 -0.0311349 0.093989 -0.0451937 0.0373602 -0.0166226 0.0882581 -0.1089309 0.1364646 -0.057859 -0.0298119 0.0913749 0.0504392 0.0337578 -0.0060765 -0.0855099 0.1105331 -0.1330006 -0.0655756 0.1527297 0.0386891 0.0024197 0.0358523 0.1398011 -0.0045446 0.0044668 0.0006476 0.3954343 0.0122398 0.0004364 -0.0425558 -0.0532068 -0.0323417 0.0761477 -0.050586 0.0627935 -0.0100806 0.0057884 -0.0066348 0.042089 -0.0616653 -0.0186465 -0.0794913 0.043801 -0.0666613 -0.033322 0.0780944 0.0173197 -0.0247562 0.098526 0.0219777 0.1170538 -0.0668479 0.1063513 -0.0515857 0.0812254 0.0120729 0.0235023 0.0857561 0.0493573 -0.1055117 0.0747957 -0.0931861 -0.0809213 -0.0687884 -0.1081387 -0.0052988 -0.1301117 -0.0600677 -0.0104344 -0.0058821 -0.0101701 0.1209214 unknown
polarizability: 118.0614268|-0.1103377|82.4640636|0.1027045|1.0921776|52.0943317 unknown
InChI: InChI=1S/C5H10N2S/c1-2-8-5-6-3-4-7-5/h6H,2-4H2,1H3
charge 0 multiplicity 1
18 atoms
S  1.266514 -1.070418 0.078713
N  -1.497309 -1.160695 0.07545
N  -0.625444 0.974595 0.147445
C  -2.7325 -0.346014 0.115235
C  -2.126535 1.113771 0.14811
C  -0.385872 -0.317732 0.104944
C  2.306061 0.522118 0.159613
C  3.79185 0.147072 0.115599
H  -3.336354 -0.568226 1.016094
H  -3.361651 -0.518121 -0.778683
H  -2.436186 1.703424 -0.733659
H  -2.440867 1.666718 1.051451
H  -1.471924 -2.176919 0.060451
H  1.994451 1.145012 -0.692499
H  2.021379 1.038371 1.089067
H  4.076124 -0.495982 0.967669
H  4.051137 -0.380532 -0.819558
H  4.403528 1.066758 0.166858
