program: Gaussian 09
title: 000081750
version: EM64L-G09RevD.01
frameworkgroup: C1[X(C9H12O3)]
method: RPBEPBE
basis: SDD
operation: Freq
keyword: #pfreq=noraman
keyword: PBEPBE/SDD
title: #p freq=noraman PBEPBE/SDD
converged: YES YES NO NO
title: Mulliken charges:
elementType: O O O C C C C C C C C C H H H H H H H H H H H H
charge: -0.284981 -0.275581 -0.481084 0.264763 0.211023 -0.345900 -0.502987 0.339568 -0.413607 -0.374542 -0.534055 -0.536324 0.283610 0.260828 0.215002 0.215253 0.238577 0.223464 0.223348 0.240567 0.351551 0.240520 0.220494 0.220492
chargesum: 0.00000
title: Mulliken charges with hydrogens summed into heavy atoms:
elementType: O O O C C C C C C C C C
charge: -0.284981 -0.275581 -0.129533 0.264763 0.211023 -0.062289 -0.242159 0.339568 0.016648 -0.135965 0.153324 0.145182
polarizability: 1.48674020e+02 5.48792072e+00 1.21321041e+02 -2.29618119e-02 -2.02661695e-02 5.83574252e+01
1716.lowfreq: -0.0007 0.0002 0.0005 3.3596 8.6169 12.1495 63.4345 84.1422 101.9146
frequency: 63.4225 84.1196 101.9099 142.7465 164.2344 172.4898 199.1229 227.7040 240.4050 268.9793 280.3576 331.5458 335.0388 399.2992 457.8566 486.9712 540.7527 593.6533 616.1567 690.5353 709.7019 757.5095 796.5363 843.7600 878.5369 947.6345 984.4939 993.1280 1016.3925 1017.6069 1107.4079 1111.9945 1113.3607 1139.2086 1155.2498 1157.0497 1175.2326 1195.7289 1202.4325 1261.5861 1281.0479 1382.0185 1409.3244 1415.2235 1433.8403 1447.4967 1464.7465 1464.8661 1465.4873 1473.2858 1476.2948 1506.1319 1592.8819 1627.7442 2935.9650 2957.6510 2961.2032 2976.8480 3043.9554 3048.9926 3120.8891 3122.5683 3156.4730 3177.3539 3179.8526 3589.8400
redmass: 4.0981 2.9440 3.1515 2.7907 4.5244 3.4334 1.5583 1.1075 1.1224 1.9819 3.3721 3.4467 6.4576 4.4538 3.0360 5.3870 6.0072 4.1549 4.2371 5.7210 2.5586 4.0658 1.3334 1.7736 6.1142 1.3211 8.6764 8.6130 1.6999 3.3809 2.3133 1.2605 1.2608 1.5413 1.2494 1.3882 1.7175 1.0611 1.6252 3.5026 1.4898 2.6927 1.9742 2.7372 1.1812 1.4427 1.0503 1.0500 1.1102 1.0870 1.0586 2.6741 8.1413 6.9357 1.0551 1.0329 1.0326 1.1051 1.1038 1.1039 1.0994 1.0998 1.0882 1.0926 1.0938 1.0665
irintensity: 0.0102 16.4665 5.2556 17.5446 7.2112 3.2349 0.1281 89.8968 70.1881 5.0630 0.0025 0.0059 1.4134 8.9438 2.5954 17.1335 16.8329 1.3820 6.6575 2.7855 3.1010 7.3151 29.0601 56.4982 14.8495 3.4035 113.6455 1.1106 0.2020 91.4822 82.3755 0.1361 0.1702 23.5311 59.1905 49.7052 102.8507 0.1512 36.7850 63.9274 2.4639 49.8458 12.6608 8.1692 14.5411 14.9896 4.8816 20.3698 34.6018 61.8906 19.3505 104.5453 61.9298 119.1133 50.8148 70.0910 59.5125 45.1646 49.7687 48.9598 27.5392 24.2920 7.5760 5.9560 2.1084 4.6857
temp: 298.150 k
press: 1.00000 atm
elementType: 8 8 8 6 6 6 6 6 6 6 6 6 1 1 1 1 1 1 1 1 1 1 1 1
symmnumber: 1
zpe: 506462.0 jmol-1
zpe.correction: 0.192901 hartree
zpe.thermalcorrener: 0.205472 hartree
zpe.thermalcorrenthalpy: 0.206416 hartree
zpe.thermalcorrgfe: 0.154304 hartree
zpe.sumelectzpe: -574.868271 hartree
zpe.sumelectthermal: -574.855700 hartree
zpe.sumelectthermalent: -574.854756 hartree
zpe.sumelectthermalfe: -574.906868 hartree
dipole: 0.2347 1.0437 0.0001
dipole: 1.0697
quadrupole: -53.4313 -63.0999 -74.4440
quadrupole: 4.9090 -0.0457 0.0341
quadrupole: 10.2271 0.5585 -10.7856 4.9090 -0.0457 0.0341
hfenergy: -575.0611724 hartree
pointgroup: C01 [X(C9H12O3)]
dipole: 0.1379755 0.3952522 0.0431873 debye
dipolederiv: -0.8064597 -0.6231122 -0.0687124 -0.5405984 -1.1823054 -0.0985865 -0.058939 -0.0976758 -0.3016277 -1.7284694 0.0561037 0.0051887 0.2599951 -0.3646845 -0.006621 0.0270864 -0.0066357 -0.302196 -0.2161228 0.1526997 0.0146236 0.2724839 -0.8293643 -0.0257459 0.0271238 -0.0251952 -0.5933343 -0.0120648 -0.1323199 -0.0148291 -0.2789215 -0.3630276 -0.0294228 -0.0315743 -0.0290642 -0.0987386 0.8273296 0.6468961 0.0722811 0.5284996 0.7920255 0.0783903 0.0586223 0.0781911 0.0851515 0.2668686 0.1212044 0.0135992 0.0035374 0.0942633 0.0231683 0.0010968 0.0229886 -0.1189643 -0.5987414 -0.1272286 -0.014422 -0.0670298 -0.109606 0.013304 -0.0074523 0.0130608 -0.2295518 1.4129945 -0.1413717 -0.0139372 -0.5734529 0.3274146 0.0242988 -0.0601143 0.024707 0.101676 0.2354264 -0.1654223 -0.0174161 -0.2648713 0.726379 0.0318286 -0.0276777 0.0315688 0.4333381 -0.3533455 -0.0036178 -0.0009725 0.3881767 -0.2195467 0.0032771 0.0409944 0.0031708 -0.2501208 0.190372 -0.0537905 -0.006051 0.2315254 0.8048022 0.0538967 0.0253309 0.0536068 0.3273722 0.7729221 0.0767079 0.0083571 0.401106 0.279489 -0.0050681 0.0430177 -0.0053209 0.3282932 0.1424028 -0.0086174 -0.0009978 0.0160652 -0.020756 -0.0190464 0.0019211 -0.0190595 0.1543574 0.1101986 0.0346224 0.0037465 0.0285218 -0.0508813 -0.0250014 0.0027681 -0.0250648 0.1766874 -0.0640138 -0.0146766 0.0849629 -0.0021626 -0.069689 0.0667985 0.1303478 0.0688955 -0.0710495 -0.063849 0.0031471 -0.0861791 0.0245502 -0.0415146 -0.060357 -0.1277184 -0.0625508 -0.0981488 -0.0457401 -0.091302 -0.0097701 -0.1056097 0.0249271 -0.0163054 -0.0113386 -0.0161764 0.1752994 0.0534379 0.1127501 0.1300373 -0.0318181 -0.0350175 -0.0186608 0.0735491 -0.0734016 -0.0994425 0.0526826 0.1389803 -0.1025728 -0.0144597 -0.0574216 0.0279059 -0.0791254 0.0822007 -0.0758696 -0.0974947 -0.1372161 -0.0147873 -0.0821142 0.0108511 -0.0120554 -0.008822 -0.0120239 0.1188256 -0.0045729 0.0639729 0.0082332 -0.0154902 0.2979722 -0.0114548 -0.0001637 -0.0118235 0.4045379 -0.121388 0.0746458 0.0078964 0.131397 0.0265363 -0.0100572 0.0139735 -0.0100824 0.1199678 0.0238163 0.0121547 -0.0334566 -0.1584372 -0.0443719 0.1250594 0.0187532 0.1130891 -0.0692924 0.0238108 0.0047899 0.0351778 -0.1508927 0.0035263 -0.109545 -0.0516594 -0.0974047 -0.11717 unknown
polarizability: 149.5553039|2.2691725|119.7161693|0.2959653|6.6631441|59.0810128 unknown
InChI: InChI=1S/C9H12O3/c1-11-8-4-3-7(6-10)9(5-8)12-2/h3-5,10H,6H2,1-2H3
charge 0 multiplicity 1
24 atoms
O  1.987858 1.42714 0.342254
O  -2.817522 0.686969 0.256884
O  2.629238 -2.704937 -0.104226
C  1.156206 -0.796838 0.09965
C  0.858639 0.589084 0.249609
C  0.081828 -1.697324 0.002504
C  -0.47025 1.052762 0.29841
C  -1.531293 0.118021 0.196714
C  2.602462 -1.243601 0.051029
C  -1.265419 -1.261598 0.049045
C  1.753329 2.86309 0.502221
C  -3.956878 -0.225892 0.15955
H  0.317994 -2.758611 -0.111206
H  -0.722357 2.109733 0.412888
H  3.119015 -0.742012 -0.795672
H  3.12102 -0.930893 0.982868
H  -2.072937 -1.994506 -0.029217
H  1.199077 3.077295 1.436723
H  1.1957 3.277214 -0.360177
H  2.754329 3.316808 0.550952
H  3.569125 -3.009105 -0.140112
H  -4.847744 0.416023 0.227861
H  -3.959219 -0.958025 0.990779
H  -3.959402 -0.766796 -0.807134
