program: Gaussian 09
title: 000081774
version: EM64L-G09RevD.01
frameworkgroup: C1[X(C8H18S6)]
method: RPBEPBE
basis: SDD
operation: Freq
keyword: #pfreq=noraman
keyword: PBEPBE/SDD
title: #p freq=noraman PBEPBE/SDD
converged: YES YES NO NO
title: Mulliken charges:
elementType: S S S S S S C C C C C C C C H H H H H H H H H H H H H H H H H H
charge: 0.042619 0.052548 -0.047913 -0.051432 -0.045164 -0.047064 -0.090960 -0.092544 -0.631425 -0.655692 -0.628998 -0.628591 -0.656060 -0.631938 0.230074 0.210139 0.241338 0.236579 0.234236 0.223161 0.234130 0.210432 0.235265 0.238762 0.209669 0.232648 0.234255 0.238384 0.222688 0.240460 0.210042 0.230353
chargesum: 0.00000
title: Mulliken charges with hydrogens summed into heavy atoms:
elementType: S S S S S S C C C C C C C C
charge: 0.042619 0.052548 -0.047913 -0.051432 -0.045164 -0.047064 -0.090960 -0.092544 0.050127 0.038283 0.050829 0.052488 0.039267 0.048917
polarizability: 3.95121135e+02 5.77691920e+00 1.96991298e+02 6.14580070e+00 -3.18763685e+00 1.58507860e+02
1716.lowfreq: -22.8944 -16.7425 -8.0499 -0.0026 0.0014 0.0024 4.6500 10.2899 11.1649
frequency: -19.5982 -12.0423 9.5835 32.5820 35.1755 48.7884 57.4282 85.6930 112.0230 147.5260 155.2548 175.5888 183.1270 186.4331 193.6557 237.0957 241.5321 260.3301 262.4031 268.8899 271.5290 281.7641 283.7085 288.6222 340.5270 342.2339 344.2527 377.5604 379.6621 381.7694 390.0491 390.8315 432.9999 435.4190 500.9536 501.7981 785.1395 786.1495 926.3597 928.0033 929.0212 929.1084 951.0903 952.0890 1013.5361 1014.2282 1017.6252 1019.1125 1153.8904 1156.7757 1232.9952 1234.4260 1239.2462 1241.2632 1376.3343 1376.4126 1377.8615 1378.8049 1402.5455 1402.8785 1445.6928 1445.7637 1457.3404 1457.6121 1459.5581 1459.6249 1471.1445 1471.4087 1472.0327 1472.2671 1487.0082 1487.0911 2972.7031 2972.7794 2974.5338 2975.1040 2979.1787 2979.4219 3066.2663 3066.3032 3068.6968 3068.9378 3074.3811 3074.5555 3085.3323 3086.1915 3092.6027 3093.7835 3097.2832 3098.0348
redmass: 3.2560 4.1489 4.9899 5.2358 4.7282 5.8236 6.8884 8.6797 8.6231 7.9566 6.9564 1.0291 5.3121 1.1294 10.2737 1.0722 1.0548 1.1790 1.1521 2.6524 2.5818 3.3072 3.1193 8.8469 8.3724 3.6873 3.7246 4.2149 2.9527 3.4485 3.1701 3.3755 8.8631 9.7182 3.1786 3.1547 3.2934 3.2877 1.5528 1.5596 1.5286 1.5305 1.2085 1.2062 1.4685 1.4715 1.4348 1.4371 1.8775 1.8783 3.0351 3.0688 3.0154 3.0228 1.1972 1.1941 1.2162 1.2151 1.1990 1.1988 1.0468 1.0473 1.0477 1.0480 1.0488 1.0484 1.0533 1.0528 1.0513 1.0508 1.0518 1.0514 1.0371 1.0365 1.0361 1.0358 1.0368 1.0367 1.0976 1.0971 1.0980 1.0980 1.0972 1.0971 1.1013 1.1011 1.1004 1.1004 1.1002 1.1002
irintensity: 0.1636 0.9886 0.7196 0.1225 0.0828 0.6540 0.2639 0.2480 0.6873 1.1508 0.1335 0.0438 1.2236 0.0526 0.7931 0.0926 0.1602 0.6817 1.2048 0.7091 1.5885 0.3124 0.8148 1.8957 6.4311 1.0397 0.2753 1.3351 0.5937 0.5779 7.3842 3.2266 21.7900 5.3390 10.2418 7.1174 0.4397 0.3779 1.0098 1.1351 0.9027 1.0254 0.0125 0.0210 3.2242 4.4642 1.2023 0.6625 356.4625 34.4693 7.5865 6.6962 8.5593 8.4729 32.1577 32.1978 29.4913 27.0577 21.2016 5.8433 0.3303 0.4373 0.8722 1.3590 1.9564 1.7620 17.0541 17.5168 11.7792 14.6829 40.0779 10.3131 18.4207 22.1378 16.6357 17.6847 99.5736 15.8635 3.4457 4.4954 8.1407 7.9389 126.1028 14.4775 6.0456 8.0239 27.5528 25.5055 21.8677 21.1250
temp: 298.150 k
press: 1.00000 atm
elementType: 16 16 16 16 16 16 6 6 6 6 6 6 6 6 1 1 1 1 1 1 1 1 1 1 1 1 1 1 1 1 1 1
symmnumber: 1
zpe: 645231.7 jmol-1
zpe.correction: 0.245756 hartree
zpe.thermalcorrener: 0.266721 hartree
zpe.thermalcorrenthalpy: 0.267666 hartree
zpe.thermalcorrgfe: 0.193429 hartree
zpe.sumelectzpe: -2702.877676 hartree
zpe.sumelectthermal: -2702.856711 hartree
zpe.sumelectthermalent: -2702.855767 hartree
zpe.sumelectthermalfe: -2702.930003 hartree
dipole: 0.9961 2.2656 1.2055
dipole: 2.7529
quadrupole: -98.0324 -133.3276 -134.3350
quadrupole: -6.8350 -2.9272 0.4322
quadrupole: 23.8659 -11.4292 -12.4367 -6.8350 -2.9272 0.4322
hfenergy: -2703.1234322 hartree
pointgroup: C01[X(C8H18S6)]
dipole: 0.3637097 -0.8223983 -0.6036886 debye
polarizability: 394.5599745|-10.4811455|197.5237301|-8.6757033|2.8584815|158.5365873 unknown
InChI: InChI=1S/C8H18S6/c1-7(2,3)9-11-13-14-12-10-8(4,5)6/h1-6H3
charge 0 multiplicity 1
32 atoms
S  2.765787 -0.934051 -0.420843
S  -3.279414 -0.071502 1.322322
S  1.555369 -0.077438 1.259125
S  -2.734981 2.027144 0.763101
S  0.953024 2.086716 0.691384
S  -0.877323 1.960932 -0.621893
C  4.595467 -0.364908 -0.022715
C  -4.416557 -0.679517 -0.149005
C  5.005547 -0.919214 1.352691
C  5.393932 -1.021762 -1.17279
C  4.675232 1.170453 -0.074168
C  -3.597148 -0.698389 -1.450868
C  -4.797621 -2.106472 0.309843
C  -5.644982 0.241069 -0.251992
H  4.948212 -2.02133 1.374905
H  6.047725 -0.618419 1.576335
H  4.355011 -0.518352 2.150117
H  5.073247 -0.642951 -2.1595
H  5.29141 -2.121792 -1.164468
H  6.46633 -0.779259 -1.045738
H  4.060886 1.630325 0.719894
H  5.725002 1.487808 0.081552
H  4.332672 1.561987 -1.047402
H  -2.688762 -1.316182 -1.34797
H  -4.216911 -1.117934 -2.267385
H  -3.291378 0.320665 -1.746636
H  -5.335767 -2.096376 1.274666
H  -3.907734 -2.75358 0.407133
H  -5.466448 -2.557191 -0.448256
H  -5.343417 1.279239 -0.478409
H  -6.302656 -0.110716 -1.070805
H  -6.226552 0.242496 0.686274
