program: Gaussian 09
title: 000081744
version: EM64L-G09RevD.01
frameworkgroup: C1[X(C9H8O3)]
method: RPBEPBE
basis: SDD
operation: Freq
keyword: #p
keyword: freq=noraman
keyword: PBEPBE/SDD
title: #p freq=noraman PBEPBE/SDD
converged: YES YES NO YES
title: Mulliken charges:
elementType: O O O C C C C C C C C C H H H H H H H H
charge: -0.390626 -0.214312 -0.287056 0.484357 0.270445 0.285684 -0.572349 -0.466302 0.016280 -0.800899 -0.203515 -0.170257 0.245177 0.282123 0.239949 0.224408 0.239974 0.223040 0.207199 0.386680
chargesum: 0.00000
title: Mulliken charges with hydrogens summed into heavy atoms:
elementType: O O O C C C C C C C C C
charge: -0.003945 -0.214312 -0.287056 0.484357 0.270445 0.285684 -0.327172 -0.184179 0.016280 -0.096568 0.019525 0.036941
polarizability: 1.55588354e+02 -3.69260127e+00 1.33258975e+02 3.35927420e-03 -3.28541536e-03 4.68538257e+01
1716.lowfreq: -7.1787 -0.0009 -0.0005 -0.0005 7.9341 10.9073 46.5532 91.0092 136.1968
frequency: 46.4207 91.0050 136.1964 169.7124 171.6742 201.6488 232.4994 300.1478 331.5000 365.4437 367.0774 432.2294 461.5088 488.7752 540.6800 563.7342 615.6729 747.5454 760.1821 794.6339 883.7443 941.7795 952.3718 967.3408 973.1984 975.8772 1003.8082 1028.5402 1057.4916 1164.9404 1230.5808 1256.9016 1302.1556 1343.5733 1360.7765 1380.1552 1394.7459 1407.1450 1416.9381 1445.6128 1469.6712 1480.9166 1560.3883 1587.5383 1611.2337 1638.6582 2773.3517 2967.6997 2979.0192 2983.7128 3064.5464 3088.7257 3116.2882 3129.2444
redmass: 1.0466 7.7218 4.1486 7.2624 4.5939 2.6626 4.2148 2.5998 4.6536 7.2454 4.3943 6.2560 6.4830 3.6080 5.0280 2.7124 6.7635 5.0569 4.6294 6.1499 1.4133 1.2364 1.3428 2.6010 4.6031 1.4643 1.7336 1.8254 1.5730 1.7805 1.4934 3.3512 2.8523 1.4669 2.7475 1.5931 2.7521 1.4030 3.2997 2.9506 1.0442 1.1537 4.4528 5.4716 4.0339 5.2264 1.0726 1.0877 1.0893 1.0374 1.0979 1.0993 1.0915 1.0917
irintensity: 0.4293 0.9552 1.8507 8.1042 6.4168 13.2009 1.1969 4.0625 5.8724 3.3025 0.6638 2.4663 11.0330 1.6759 6.6419 6.6246 65.9222 12.2098 9.8773 11.8539 14.3412 79.9879 15.8255 67.5224 1.0741 53.5358 4.0475 18.8933 16.0588 10.7181 81.1675 20.8472 9.0227 141.0101 61.9337 13.7209 31.6851 28.4756 63.0696 241.1314 14.5164 18.7704 88.5837 257.8372 8.5328 168.9084 302.7120 48.2451 49.1880 28.2633 15.3994 13.2091 8.9924 3.0664
temp: 298.150 k
press: 1.00000 atm
elementType: 8 8 8 6 6 6 6 6 6 6 6 6 1 1 1 1 1 1 1 1
symmnumber: 1
zpe: 387332.6 jmol-1
zpe.correction: 0.147527 hartree
zpe.thermalcorrener: 0.158463 hartree
zpe.thermalcorrenthalpy: 0.159408 hartree
zpe.thermalcorrgfe: 0.110430 hartree
zpe.sumelectzpe: -572.566715 hartree
zpe.sumelectthermal: -572.555779 hartree
zpe.sumelectthermalent: -572.554835 hartree
zpe.sumelectthermalfe: -572.603813 hartree
dipole: -0.7105 5.1476 0.0005
dipole: 5.1964
quadrupole: -82.1700 -66.5429 -70.3838
quadrupole: 5.1085 0.0023 -0.0018
quadrupole: -9.1378 6.4893 2.6484 5.1085 0.0023 -0.0018
hfenergy: -572.7142425 hartree
pointgroup: C01 [X(C9H8O3)]
dipole: -0.6049503 -1.9525527 0.0360281 debye
dipolederiv: -0.61668 0.3685676 -0.0005711 0.3682702 -0.9603713 0.0015524 -0.0005701 0.0014933 -0.3706524 -1.0866381 -0.4633857 0.019138 -0.1322678 -0.4917855 0.0043476 0.0147528 0.0100597 -0.3361699 -1.0125815 0.1387584 0.0098559 0.7045762 -0.6893465 -0.0079089 0.0023998 0.0021416 -0.3501802 -0.5809748 -0.467846 0.0154374 -0.5112718 0.1979479 0.0058042 0.0159234 0.0052217 -0.0524871 -0.4027858 0.1586835 0.0045176 -0.5038022 -0.8101208 0.0191771 0.0132758 0.0076139 -0.0203537 -1.0731299 -0.0119059 0.0192042 0.2026193 -0.3217391 0.000815 0.016472 0.0045818 0.0025261 0.5543203 0.2225735 -0.0148513 -0.4314173 -0.0004974 0.0059986 -0.0061585 -0.0055649 -0.122346 0.128807 -0.0845479 -0.0025812 0.5088013 0.3178005 -0.0142048 -0.0103458 -0.0038645 -0.079153 0.5819262 -0.4338555 -0.0026747 -0.271156 0.7682793 -0.0044789 -0.0049661 -0.0015954 0.0939461 -0.0129293 0.1354035 -0.0005299 0.0958766 -0.0450444 -0.0003675 0.0001261 -0.0012948 0.0583924 1.2184428 0.5410645 -0.0261512 0.6055215 1.0715901 -0.0229519 -0.0269636 -0.0217479 0.1222688 1.6839278 -0.1437265 -0.026015 -0.4112034 0.674921 -0.0003635 -0.0225294 -0.0050191 0.1104264 0.0420023 -0.0971357 0.0031255 -0.0630345 -0.0264121 0.0033979 0.0026789 0.0039877 0.1466569 0.0125883 0.0501616 0.0015459 0.0131806 0.1286701 -0.0001011 0.0020044 -0.0007483 0.1379388 0.0279873 0.0580815 -0.1079703 0.0286719 0.0314866 -0.0102791 -0.1129217 0.0552702 -0.0277517 -0.0250822 -0.1614928 0.0047456 -0.0376331 -0.0457311 0.0028683 0.0029967 0.0051371 0.1121105 0.0360684 0.0589096 0.1040411 0.032166 0.0300969 0.0074034 0.1097705 -0.0590905 -0.0345618 0.024673 0.1316866 -0.0000059 0.0263834 -0.1175984 0.0026893 0.001368 0.0008436 0.1234843 0.0073309 -0.0499237 0.0026635 -0.1799368 -0.140663 0.0066968 0.0043668 0.0043652 0.1185699 0.4927275 0.0499293 -0.0029242 -0.0443442 0.4285173 -0.000095 -0.00168 -0.0017904 0.3673357 unknown
polarizability: 156.1490362|-0.1096503|132.6496849|-1.9211791|-1.1263694|46.9024339 unknown
InChI: InChI=1S/C9H8O3/c1-6-2-7(4-10)9(12)8(3-6)5-11/h2-5,12H,1H3
charge 0 multiplicity 1
20 atoms
O  -1.042612 2.043856 -0.018443
O  3.08586 1.810298 -0.086736
O  -3.323611 0.887347 0.037619
C  0.741104 -1.813998 0.001418
C  0.951908 0.668368 -0.034868
C  -1.283509 -0.390339 0.018463
C  -0.661007 -1.670659 0.024378
C  1.52139 -0.626671 -0.027838
C  -0.468926 0.798523 -0.011768
C  1.405113 -3.178618 0.007562
C  1.824456 1.870793 -0.065684
C  -2.73198 -0.254343 0.042459
H  -1.300135 -2.56331 0.04743
H  2.617656 -0.681605 -0.046257
H  2.065438 -3.298721 0.886167
H  0.661185 -3.992973 0.032436
H  2.032327 -3.322822 -0.891449
H  1.292619 2.847321 -0.069187
H  -3.341366 -1.18225 0.065853
H  -2.070509 1.917504 0.001148
