program: Gaussian 09
title: 000081731
version: EM64L-G09RevD.01
frameworkgroup: C1[X(C7H12N2)]
method: RPBEPBE
basis: SDD
operation: Freq
keyword: #pfreq=noraman
keyword: PBEPBE/SDD
title: #p freq=noraman PBEPBE/SDD
converged: YES YES NO NO
title: Mulliken charges:
elementType: N N C C C C C C C H H H H H H H H H H H H
charge: -0.352062 -0.043977 -0.425981 -0.468776 0.367270 0.140293 -0.385934 -0.797350 -0.782507 0.200983 0.245719 0.215613 0.212317 0.294909 0.191767 0.220301 0.245680 0.237869 0.250656 0.218485 0.214726
chargesum: 0.00000
title: Mulliken charges with hydrogens summed into heavy atoms:
elementType: N N C C C C C C C
charge: -0.057153 -0.043977 0.020721 -0.040846 0.367270 0.140293 -0.194167 -0.093501 -0.098641
polarizability: 1.10931071e+02 2.46352680e+00 1.02026686e+02 7.30669939e-01 -5.08116642e-01 5.86846156e+01
1716.lowfreq: -0.0005 -0.0001 0.0001 7.6808 13.6617 25.2126 94.0985 103.4819 130.7948
frequency: 94.0939 103.4540 130.7652 169.1162 197.3244 270.4648 299.0605 387.5966 400.6462 407.1470 416.6040 534.2932 597.5536 606.9481 653.5516 796.2822 808.4386 872.6570 898.0237 941.6164 978.3335 1021.0024 1036.9697 1046.2496 1055.3828 1094.3136 1115.1334 1211.7545 1225.3515 1237.8933 1289.0327 1320.0363 1347.4667 1374.2832 1397.1859 1405.2734 1451.5090 1458.0267 1460.5801 1466.2831 1467.4102 1470.4883 1524.4007 1576.6964 1633.7359 2956.6995 2971.0373 2972.7303 2984.8683 3028.1678 3043.8997 3050.4674 3051.1226 3113.9145 3118.3048 3123.5410 3560.2249
redmass: 1.1158 2.6993 1.1317 2.2055 2.2600 2.6423 2.2318 3.3790 1.4612 2.9167 3.2541 3.5225 2.4255 3.5912 3.0193 3.1436 1.2460 2.8927 2.8776 2.3678 1.7125 1.7986 1.7132 1.5286 1.9092 3.1145 2.8928 1.3659 1.9928 1.7357 1.3578 1.2076 1.2752 1.2492 1.2346 1.5001 1.1351 1.1690 1.0747 1.0498 1.0538 1.0590 1.8959 5.2764 5.4688 1.0642 1.0396 1.0379 1.0612 1.0991 1.0975 1.0971 1.1017 1.0951 1.0975 1.0898 1.0774
irintensity: 0.5202 0.1983 1.0298 2.3246 7.4131 2.1499 3.2537 22.4100 71.3462 7.1561 12.3918 0.8304 6.2632 6.1448 0.6386 1.3349 35.8909 19.7303 3.4333 2.3977 1.4385 6.0428 3.0792 12.7711 0.4526 0.6219 5.4785 17.1692 14.2290 12.8993 3.6317 19.1872 14.3953 27.5550 13.0658 19.6632 20.2163 36.6096 8.8781 18.4218 11.5510 19.5263 65.6497 121.9372 200.5066 58.3007 46.5669 23.5821 46.9013 52.2374 21.5445 26.9058 46.6691 5.7732 13.0808 28.9104 31.7257
temp: 298.150 k
press: 1.00000 atm
elementType: 7 7 6 6 6 6 6 6 6 1 1 1 1 1 1 1 1 1 1 1 1
symmnumber: 1
zpe: 473873.2 jmol-1
zpe.correction: 0.180489 hartree
zpe.thermalcorrener: 0.190081 hartree
zpe.thermalcorrenthalpy: 0.191025 hartree
zpe.thermalcorrgfe: 0.146217 hartree
zpe.sumelectzpe: -382.721223 hartree
zpe.sumelectthermal: -382.711631 hartree
zpe.sumelectthermalent: -382.710687 hartree
zpe.sumelectthermalfe: -382.755495 hartree
dipole: 4.4621 0.0513 0.1432
dipole: 4.4647
quadrupole: -53.9939 -49.7560 -57.0409
quadrupole: 4.7607 -0.9374 0.4130
quadrupole: -0.3970 3.8409 -3.4440 4.7607 -0.9374 0.4130
hfenergy: -382.9017121 hartree
pointgroup: C01 [X(C7H12N2)]
dipole: 1.7515655 -0.1315994 -0.0102226 debye
dipolederiv: -0.5578684 0.0005017 0.0964441 0.455895 -0.8447033 -0.1476306 0.2042568 -0.0934691 -0.4550794 -0.5535064 -0.1261577 0.0848449 -0.3395533 -0.6976234 0.0526143 -0.0037185 0.0056604 -0.3718063 0.2074953 0.1866141 0.0914817 0.0155804 0.2772544 0.0826938 0.0494888 0.0776186 0.260745 0.0023303 0.0034195 -0.0092668 0.1470285 0.4413053 -0.0644939 0.0123708 -0.0077759 0.2295877 0.8280893 -0.2123085 -0.0897624 -0.7241066 0.8044198 0.2035307 -0.1528588 0.1369602 0.0771743 1.0101395 -0.0202188 0.0182678 0.2143236 0.5975618 -0.1138681 0.1083382 -0.1094516 0.0630747 -1.0685516 0.1376309 0.0575963 0.1068511 -0.1578523 0.0142659 -0.0969001 0.034515 -0.3181577 -0.0610995 -0.126471 -0.0260764 -0.0383689 -0.0377738 -0.0321099 0.0785735 -0.0427873 0.0742416 -0.1344797 0.1216816 -0.0310267 0.1789669 -0.159496 0.0399988 -0.0158043 0.046932 0.0639525 -0.0069374 0.1511778 -0.002557 0.0796262 -0.1620346 -0.0213055 -0.0083431 -0.0064116 0.1004214 0.0488507 -0.0839915 -0.0725322 0.0100286 0.0420525 0.05638 -0.0180485 -0.0495718 -0.1324621 0.0148541 -0.1160247 0.0062862 -0.0779403 -0.1970133 0.0185018 0.0047631 -0.0284118 0.0813479 0.0372255 0.106199 -0.1005091 0.0084372 0.0085498 -0.045357 -0.0384056 0.0594226 -0.1449274 0.1401523 -0.0316249 -0.0429392 0.0092218 0.1531633 -0.0246741 -0.1009326 -0.0130202 0.2905239 0.0608152 -0.0297148 -0.0064113 -0.0302119 -0.1389885 -0.0201268 -0.0380033 -0.0163684 0.166435 -0.0397897 0.0124286 -0.093155 0.086743 0.029472 0.0997442 -0.1416118 0.0519088 -0.0079981 0.0867437 0.0925736 0.0256822 -0.0020576 -0.0853099 -0.0613866 -0.0015882 -0.052879 0.0973655 -0.0600038 -0.0408911 0.0853722 -0.0251648 0.0859541 -0.0237144 0.1425825 0.0154388 -0.0629285 -0.0898741 -0.0374645 -0.0135758 -0.1272902 0.0783294 -0.0053206 -0.0007259 0.000723 0.107636 0.0656823 0.0025635 0.0585438 0.0106518 0.0156416 0.1027042 0.0060441 0.1320734 -0.0873637 0.0697324 0.0100774 -0.0367072 0.0413394 -0.0529088 -0.1104461 0.0105231 -0.1411061 -0.0317825 unknown
polarizability: 110.5847516|-3.0064043|102.3808569|0.6219661|0.2376604|58.6767645 unknown
InChI: InChI=1S/C7H12N2/c1-6-5-7(2)9-4-3-8-6/h5,8H,3-4H2,1-2H3
charge 0 multiplicity 1
21 atoms
N  1.554791 -0.854827 -0.190765
N  -1.698491 -0.7073 0.104144
C  0.513679 -1.829725 -0.525573
C  -0.720261 -1.759071 0.431714
C  1.31881 0.487117 0.052449
C  -1.286378 0.545714 -0.023229
C  0.071238 1.10231 0.079429
C  2.586815 1.30621 0.240396
C  -2.378048 1.578612 -0.288354
H  0.968583 -2.836529 -0.482871
H  0.149742 -1.667473 -1.559099
H  -1.251709 -2.728076 0.384401
H  -0.336845 -1.637872 1.467401
H  2.503729 -1.199682 -0.048348
H  0.106382 2.195155 0.16199
H  3.234557 0.864086 1.023314
H  2.346205 2.335317 0.54663
H  3.177424 1.351872 -0.694818
H  -3.35612 1.07548 -0.326951
H  -2.203395 2.110818 -1.242855
H  -2.397807 2.342763 0.513096
